{"text_format":"1","workbook":"xlsx","n_sheets":3,"sheets":["Table","Open","Elaboration data"],"not_rendered":{"charts":9,"images":4,"macros":1,"external_links":0,"defined_names":0,"comments":0,"pivot_tables":0},"unopened":[],"bounds":{"document_bytes":16777216,"sheet_cells":100000,"rows_first":2000,"rows_last":500,"rows_between":2000,"halvings":0,"cell_chars":16384,"cell_head_chars":4096},"cells_cut":0,"cells_raw":0,"read":"whole","date_system":"1900"}

{"sheet":"Table","index":0,"n_rows":442,"n_cols":12,"rows_kept":442,"cut":false,"hidden":false,"merged":[[2,10,17,17],[1,11,1,18],[0,0,0,8]]}
["Table"]
["Total","Home","Away","Form Home 5 ","Form Away 5","Over Home","Over Away","PT/F HOME","PT/F AWAY",null,null,"AI DIRE SOCCER"]
["1.","1.","1.","1.","1.","1.","1.","1.","1.",null,"Funzionamento: Aprire diretta.it e copiate le varie classifiche negli appositi spazi, le classifiche da copiare sono: A3 la classifica principale, B3 la classifica delle partite giocate in casa; C3 la classifica delle partite giocate in trasferta, D4 le ultime cinque partite giocate in casa, E4 le ultime cinque partite giocate fuori casa, F4 le partite dell'over2,5 in casa e infine in G4 le partite giocate fuori dell'over2,5. Prima di iniziare una nuova lega bisogna cancellare tutto con l'apposito bottone."]
["Inter","Inter","Inter","Atalanta","Inter","Frosinone","Milan","Sport Recife","Novorizontino"]
["Inter","Inter","Inter","Atalanta","Inter","Frosinone","Milan","Sport Recife","Novorizontino"]
[22,11,11,5,5,12,12,12,12]
[18,9,9,5,4,10,10,7,2]
[3,1,2,0,1,2,2,0,0]
[1,1,0,0,0,"22:19:00",1.0972222222222221,0,0]
[2.1319444444444442,1.0875000000000001,1.0444444444444445,"15:02:00","12:02:00","3.4","3.8",3,4]
[41,20,21,13,10,null,null,1,1]
[57,28,29,15,13,"?","?",0,2]
[null,null,null,null,null,null,null,0,0]
["?","?","?","?","?","+","+",0,0]
[null,null,null,null,null,null,null,1,3]
["V","V","V","V","V","+","+",31,19]
[null,null,null,null,null,null,null,"2.","2."]
["V","V","V","V","V","+","+","Vitoria","Vila Nova"]
[null,null,null,null,null,null,null,"Vitoria","Vila Nova"]
["V","V","N","V","N","+","+",10,12]
[null,null,null,null,null,null,null,4,3]
["V","V","V","V","V","-","+",0,0]
[null,null,null,null,null,"2.","2.",0,0]
["N","V","V","V","V","Salernitana","Sassuolo",3,2]
["2.","2.","2.","2.","2.","Salernitana","Sassuolo",0,2]
["Juventus","Atalanta","Juventus","Inter","Milan",12,12,0,1]
["Juventus","Atalanta","Juventus","Inter","Milan",9,8,1,0]
[23,12,12,5,5,3,4,0,0]
[16,9,8,5,3,0.51666666666666672,"15:26:00",2,4]
[5,1,2,0,1,3,"3.4",24,17]
[2,2,2,0,1,null,null,"3.","3."]
[1.5097222222222222,1.1305555555555555,"19:09:00","11:01:00","13:09:00","?","?","Guarani","Vitoria"]
[22,19,10,10,4,null,null,"Guarani","Vitoria"]
[53,28,26,15,10,"+","+",10,12]
[null,null,null,null,null,null,null,6,3]
["?","?","?","?","?","+","-",1,1]
[null,null,null,null,null,null,null,0,0]
["P","V","P","V","V","+","+",1,2]
[null,null,null,null,null,null,null,1,0]
["N","V","V","V","V","+","-",0,3]
[null,null,null,null,null,null,null,0,0]
["V","V","V","V","V","+","+",0,1]
[null,null,null,null,null,"3.","3.",1,2]
["V","V","V","V","N","Napoli","Frosinone",23,17]
[null,null,null,null,null,"Napoli","Frosinone","4.","4."]
["V","V","N","V","P",11,11,"Atletico GO","Juventude"]
["3.","3.","3.","3.","3.",8,6,"Atletico GO","Juventude"]
["Milan","Juventus","Milan","Milan","Juventus",3,5,12,11]
["Milan","Juventus","Milan","Milan","Juventus","16:15:00","09:25:00",5,3]
[23,11,12,5,5,"2.8","3.1",0,0]
[15,8,7,4,3,null,null,0,1]
[4,3,3,1,1,"?","?",0,1]
[4,0,2,0,1,null,null,3,2]
[1.9354166666666668,"17:05:00",1.0972222222222221,"12:04:00","08:04:00","+","-",0,0]
[19,12,6,8,4,null,null,1,1]
[49,27,24,13,10,"+","+",2,0]
[null,null,null,null,null,null,null,1,3]
["?","?","?","?","?","-","+",23,17]
[null,null,null,null,null,null,null,"5.","5."]
["V","N","V","N","P","+","+","Criciuma","Ceara"]
[null,null,null,null,null,null,null,"Criciuma","Ceara"]
["N","V","V","V","V","+","+",11,11]
[null,null,null,null,null,"4.","4.",5,4]
["V","V","V","V","V","Atalanta","Roma",0,0]
[null,null,null,null,null,"Atalanta","Roma",0,0]
["V","V","N","V","V",12,11,2,0]
[null,null,null,null,null,7,6,0,4]
["V","N","P","V","N",5,5,2,1]
["4.","4.","4.","4.","4.",1.1305555555555555,"12:17:00",0,0]
["Atalanta","Bologna","Napoli","Bologna","Genoa","2.9","2.6",1,0]
["Atalanta","Bologna","Napoli","Bologna","Genoa",null,null,1,2]
[22,11,11,5,5,"?","?",22,16]
[12,8,5,4,2,null,null,"6.","6."]
[3,2,3,1,2,"+","+","Mirassol","Criciuma"]
[7,1,3,0,1,null,null,"Mirassol","Criciuma"]
[1.6819444444444445,"18:07:00","16:11:00","10:03:00","05:04:00","-","+",12,11]
[18,11,5,7,1,null,null,2,4]
[39,26,18,13,8,"+","-",0,2]
[null,null,null,null,null,null,null,0,0]
["?","?","?","?","?","-","-",4,0]
[null,null,null,null,null,null,null,4,2]
["V","V","N","V","N","+","+",1,2]
[null,null,null,null,null,"5.","5.",0,0]
["V","N","P","N","V","Cagliari","Lazio",0,0]
[null,null,null,null,null,"Cagliari","Lazio",1,1]
["V","V","P","V","N",11,11,22,16]
[null,null,null,null,null,7,6,"7.","7."]
["N","V","P","V","V",4,5,"Vila Nova","Botafogo SP"]
[null,null,null,null,null,0.59583333333333333,"13:16:00","Vila Nova","Botafogo SP"]
["V","V","V","V","P","2.9","2.6",10,11]
["5.","5.","5.","5.","5.",null,null,4,3]
["Bologna","Milan","Fiorentina","Torino","Lazio","?","?",0,0]
["Bologna","Milan","Fiorentina","Torino","Lazio",null,null,0,0]
[22,11,11,5,5,"+","+",2,1]
[9,8,4,3,2,null,null,3,3]
[9,1,2,2,1,"+","+",1,1]
[4,2,5,0,2,null,null,0,0]
[1.2236111111111112,"20:07:00","14:14:00","08:01:00","07:07:00","-","-",0,1]
[7,13,0,7,0,null,null,0,2]
[36,25,14,11,7,"+","-",21,16]
[null,null,null,null,null,null,null,"8.","8."]
["?","?","?","?","?","-","+","Novorizontino","Mirassol"]
[null,null,null,null,null,"6.","6.","Novorizontino","Mirassol"]
["V","N","P","N","P","Udinese","Napoli",10,10]
[null,null,null,null,null,"Udinese","Napoli",4,1]
["N","V","P","V","V",12,11,1,1]
[null,null,null,null,null,7,6,0,0]
["P","V","V","N","V",5,5,2,2]
[null,null,null,null,null,"15:19:00","16:11:00",1,1]
["N","V","N","V","N","2.8","2.5",1,2]
[null,null,null,null,null,null,null,0,1]
["P","V","P","V","P","?","?",0,0]
["6.","6.","6.","6.","6.",null,null,1,2]
["Roma","Roma","Lazio","Roma","Roma","-","-",20,14]
["Roma","Roma","Lazio","Roma","Roma",null,null,"9.","9."]
[22,11,11,5,5,"+","+","Juventude","Guarani"]
[10,7,4,3,2,null,null,"Juventude","Guarani"]
[5,3,1,2,0,"+","-",11,12]
[7,1,6,0,3,null,null,4,1]
[1.5180555555555555,1.0062499999999999,"13:16:00","09:04:00","05:08:00","+","-",0,3]
[10,15,-3,5,-3,null,null,0,0]
[35,24,13,11,6,"+","+",2,2]
[null,null,null,null,null,"7.","7.",0,2]
["?","?","?","?","?","Roma","Salernitana",3,2]
[null,null,null,null,null,"Roma","Salernitana",0,0]
["V","V","P","V","V",11,11,1,0]
[null,null,null,null,null,6,6,1,2]
["V","N","V","N","P",5,5,19,14]
[null,null,null,null,null,1.0062499999999999,"07:20:00","10.","10."]
["P","V","V","V","P",3,"2.5","CRB","Sport Recife"]
[null,null,null,null,null,null,null,"CRB","Sport Recife"]
["N","N","N","N","P","?","?",11,10]
[null,null,null,null,null,null,null,5,0]
["P","V","P","V","V","+","-",1,1]
["7.","7.","7.","7.","7.",null,null,0,0]
["Napoli","Lazio","Monza","Juventus","Atalanta","-","+",0,2]
["Napoli","Lazio","Monza","Juventus","Atalanta",null,null,3,3]
[22,11,12,5,5,"-","-",0,0]
[10,6,3,3,1,null,null,0,1]
[5,3,4,2,2,"-","+",0,0]
[7,2,5,0,2,null,null,2,3]
[1.3513888888888888,"12:07:00","09:17:00","07:02:00","05:06:00","+","+",19,13]
[6,5,-8,5,-1,"8.","8.","11.","11."]
[35,21,13,11,5,"Inter","Cagliari","Ponte Preta","CRB"]
[null,null,null,null,null,"Inter","Cagliari","Ponte Preta","CRB"]
["?","?","?","?","?",11,11,12,10]
[null,null,null,null,null,6,6,1,1]
["V","N","N","N","N",5,5,1,0]
[null,null,null,null,null,1.0875000000000001,"07:20:00",0,0]
["N","V","P","V","P","2.9","2.5",3,2]
[null,null,null,null,null,null,null,5,0]
["V","V","V","V","P","?","?",1,4]
[null,null,null,null,null,null,null,0,0]
["P","P","N","V","N","-","+",0,0]
[null,null,null,null,null,null,null,1,3]
["N","V","P","N","V","+","-",18,9]
["8.","8.","8.","8.","8.",null,null,"12.","12."]
["Fiorentina","Fiorentina","Torino","Fiorentina","Torino","-","-","Ceara","Avai"]
["Fiorentina","Fiorentina","Torino","Fiorentina","Torino",null,null,"Ceara","Avai"]
[22,11,11,5,5,"+","+",11,10]
[10,6,3,3,1,null,null,4,2]
[4,2,3,1,2,"-","-",1,0]
[8,3,5,1,2,"9.","9.",0,0]
[1.3090277777777779,"17:11:00","08:13:00","07:03:00","02:04:00","Lecce","Bologna",1,0]
[6,6,-5,4,-2,"Lecce","Bologna",1,3]
[34,20,12,10,5,12,11,2,1]
[null,null,null,null,null,6,6,0,0]
["?","?","?","?","?",6,5,0,0]
[null,null,null,null,null,0.63680555555555551,"11:15:00",2,4]
["P","P","V","P","V","2.7","2.4",17,9]
[null,null,null,null,null,null,null,"13.","13."]
["P","N","N","N","N","?","?","Botafogo SP","Ituano"]
[null,null,null,null,null,null,null,"Botafogo SP","Ituano"]
["N","V","P","V","P","+","+",10,11]
[null,null,null,null,null,null,null,2,0]
["P","V","N","V","N","+","+",0,0]
[null,null,null,null,null,null,null,0,0]
["V","V","P","V","P","-","+",3,2]
["9.","9.","9.","9.","9.",null,null,1,1]
["Lazio","Torino","Genoa","Lazio","Bologna","+","+",1,2]
["Lazio","Torino","Genoa","Lazio","Bologna",null,null,0,0]
[22,11,12,5,5,"-","-",0,2]
[10,5,3,3,1,"10.","10.",3,4]
[4,5,3,1,2,"Fiorentina","Juventus",16,9]
[8,1,6,1,2,"Fiorentina","Juventus","14.","14."]
[1.0576388888888888,"12:06:00","10:14:00","05:03:00","06:09:00",11,12,"Ituano","Sampaio Correa"]
[2,6,-4,2,-3,6,6,"Ituano","Sampaio Correa"]
[34,20,12,10,5,5,6,11,11]
[null,null,null,null,null,"17:11:00","19:09:00",4,1]
["?","?","?","?","?","2.5","2.3",0,1]
[null,null,null,null,null,null,null,0,1]
["P","N","N","N","N","?","?",0,1]
[null,null,null,null,null,null,null,3,2]
["N","V","V","V","P","-","-",2,0]
[null,null,null,null,null,null,null,0,0]
["V","N","N","V","P","+","+",1,0]
[null,null,null,null,null,null,null,1,5]
["V","V","V","P","V","-","+",16,9]
[null,null,null,null,null,null,null,"15.","15."]
["V","V","P","V","N","-","+","Londrina","Ponte Preta"]
["10.","10.","10.","10.","10.",null,null,"Londrina","Ponte Preta"]
["Torino","Frosinone","Atalanta","Napoli","Monza","+","-",11,10]
["Torino","Frosinone","Atalanta","Napoli","Monza","11.","11.",1,1]
[22,12,10,5,5,"Sassuolo","Verona",1,1]
[8,6,3,3,1,"Sassuolo","Verona",3,0]
[8,2,2,1,2,10,12,3,1]
[6,4,5,1,2,5,6,1,1]
["20:19:00","22:19:00","13:14:00","06:06:00","03:08:00",5,6,1,2]
[1,3,-1,0,-5,"13:15:00","09:18:00",0,0]
[32,20,11,10,5,"2.8","2.3",0,0]
[null,null,null,null,null,null,null,1,4]
["?","?","?","?","?","?","?",14,8]
[null,null,null,null,null,null,null,"16.","16."]
["N","P","N","V","N","-","+","Sampaio Correa","Atletico GO"]
[null,null,null,null,null,null,null,"Sampaio Correa","Atletico GO"]
["V","V","P","V","P","+","+",11,10]
[null,null,null,null,null,null,null,2,1]
["N","P","P","N","V","+","+",0,2]
[null,null,null,null,null,null,null,0,0]
["V","P","N","V","N","+","-",0,0]
[null,null,null,null,null,null,null,4,2]
["P","N","V","P","P","-","+",1,1]
["11.","11.","11.","11.","11.","12.","12.",1,0]
["Genoa","Lecce","Roma","Verona","Fiorentina","Milan","Atalanta",1,1]
["Genoa","Lecce","Roma","Verona","Fiorentina","Milan","Atalanta",2,3]
[23,12,11,5,5,11,10,14,8]
[7,5,3,2,1,5,5,"17.","17."]
[8,4,2,2,1,6,5,"Chapecoense-SC","Tombense"]
[8,3,6,1,3,0.83819444444444446,"13:14:00","Chapecoense-SC","Tombense"]
[1.0180555555555555,"15:17:00","12:17:00","06:04:00","04:06:00","2.5","2.7",11,11]
[-2,-2,-5,2,-2,null,null,0,0]
[29,19,11,8,4,"?","?",0,0]
[null,null,null,null,null,null,null,0,1]
["?","?","?","?","?","+","-",3,2]
[null,null,null,null,null,null,null,1,1]
["N","V","V","N","P","+","-",2,2]
[null,null,null,null,null,null,null,0,0]
["V","P","P","V","P","-","+",3,0]
[null,null,null,null,null,null,null,2,5]
["V","N","P","P","V","+","-",13,7]
[null,null,null,null,null,null,null,"18.","18."]
["N","V","P","V","N","+","+","Tombense","ABC"]
[null,null,null,null,null,"13.","13.","Tombense","ABC"]
["N","N","V","N","P","Verona","Inter",11,12]
["12.","12.","12.","12.","12.","Verona","Inter",2,1]
["Monza","Genoa","Bologna","Cagliari","Napoli",11,11,0,1]
["Monza","Genoa","Bologna","Cagliari","Napoli",5,5,0,0]
[23,11,11,5,5,6,6,1,0]
[7,4,1,2,1,0.50972222222222219,1.0444444444444445,0,3]
[8,5,7,2,1,"2.4","2.6",3,4]
[8,2,3,1,3,null,null,0,0]
["21:28:00","14:12:00","11:15:00","06:05:00","02:07:00","?","?",3,0]
[-7,2,-4,1,-5,null,null,2,3]
[29,17,10,8,4,"-","-",12,7]
[null,null,null,null,null,null,null,"19.","19."]
["?","?","?","?","?","+","+","Avai","Chapecoense-SC"]
[null,null,null,null,null,null,null,"Avai","Chapecoense-SC"]
["N","V","N","P","N","-","-",11,10]
[null,null,null,null,null,null,null,2,1]
["V","N","P","V","P","-","-",1,0]
[null,null,null,null,null,null,null,0,0]
["P","N","P","N","P","-","+",1,0]
[null,null,null,null,null,"14.","14.",1,1]
["P","N","V","V","P","Genoa","Monza",1,3]
[null,null,null,null,null,"Genoa","Monza",0,0]
["V","N","N","N","V",11,12,1,2]
["13.","13.","13.","13.","13.",4,5,4,3]
["Lecce","Napoli","Udinese","Lecce","Salernitana",7,7,12,6]
["Lecce","Napoli","Udinese","Lecce","Salernitana",0.59166666666666667,"09:17:00","20.","20."]
[23,11,11,5,5,"2.4","2.2","ABC","Londrina"]
[5,5,1,2,1,null,null,"ABC","Londrina"]
[9,2,6,2,1,"?","?",10,11]
[9,4,4,1,3,null,null,0,0]
[1.0229166666666667,"16:15:00","08:18:00","07:08:00","03:09:00","+","-",0,0]
[-9,1,-10,-1,-6,null,null,0,0]
[24,17,9,8,4,"-","+",1,1]
[null,null,null,null,null,null,null,3,2]
["?","?","?","?","?","-","+",3,2]
[null,null,null,null,null,null,null,0,0]
["V","V","P","V","N","-","-",0,0]
[null,null,null,null,null,null,null,3,6]
["P","V","N","P","P","-","+",6,5]
[null,null,null,null,null,"15.","15."]
["P","N","N","N","V","Bologna","Genoa"]
[null,null,null,null,null,"Bologna","Genoa"]
["P","V","P","V","P",11,12]
[null,null,null,null,null,4,5]
["N","P","P","N","P",7,7]
["14.","14.","14.","14.","14.",0.75486111111111109,"10:14:00"]
["Frosinone","Monza","Empoli","Genoa","Empoli","2.3",2]
["Frosinone","Monza","Empoli","Genoa","Empoli"]
[23,11,11,5,5,"?","?"]
[6,4,2,1,0]
[5,4,3,4,3,"+","-"]
[12,3,6,0,2]
[1.3222222222222222,"12:11:00","07:19:00","05:04:00","03:05:00","-","+"]
[-13,1,-12,1,-2]
[23,16,9,7,3,"-","-"]
[]
["?","?","?","?","?","-","+"]
[]
["P","V","N","V","N","-","-"]
[null,null,null,null,null,"16.","16."]
["N","P","P","N","P","Empoli","Fiorentina"]
[null,null,null,null,null,"Empoli","Fiorentina"]
["V","P","N","N","N",12,11]
[null,null,null,null,null,4,4]
["P","V","P","N","P",8,7]
[null,null,null,null,null,0.34513888888888888,"14:14:00"]
["P","P","N","N","N","2.1","2.5"]
["15.","15.","15.","15.","15."]
["Sassuolo","Cagliari","Sassuolo","Monza","Udinese","?","?"]
["Sassuolo","Cagliari","Sassuolo","Monza","Udinese"]
[22,11,12,5,5,"-","+"]
[5,4,2,2,0]
[4,3,2,0,2,"+","-"]
[13,4,8,3,3]
[1.195138888888889,"14:18:00","15:26:00","04:08:00","04:12:00","+","-"]
[-13,-4,-11,-4,-8]
[19,15,8,6,2,"-","-"]
[]
["?","?","?","?","?","-","-"]
[null,null,null,null,null,"17.","17."]
["P","P","P","V","P","Torino","Udinese"]
[null,null,null,null,null,"Torino","Udinese"]
["P","V","P","P","N",11,11]
[null,null,null,null,null,4,4]
["P","N","P","P","N",7,7]
[null,null,null,null,null,0.50416666666666665,"08:18:00"]
["V","V","P","V","P","1.6","2.4"]
[]
["P","N","N","P","P","?","?"]
["16.","16.","16.","16.","16."]
["Udinese","Verona","Salernitana","Udinese","Verona","-","-"]
["Udinese","Verona","Salernitana","Udinese","Verona"]
[23,11,11,5,5,"+","+"]
[2,3,1,1,0]
[13,4,3,2,1,"-","-"]
[8,4,7,2,4]
["23:37:00","12:14:00","07:20:00","08:07:00","06:10:00","-","+"]
[-14,-2,-13,1,-4]
[19,13,6,5,1,"+","+"]
[null,null,null,null,null,"18.","18."]
["?","?","?","?","?","Monza","Empoli"]
[null,null,null,null,null,"Monza","Empoli"]
["N","N","N","N","P",11,11]
[null,null,null,null,null,3,4]
["P","V","P","P","P",8,7]
[null,null,null,null,null,"12:11:00","07:19:00"]
["P","P","V","P","P","2.1","2.4"]
[]
["N","V","P","V","P","?","?"]
[]
["P","N","P","N","N","-","-"]
["17.","17.","17.","17.","17."]
["Cagliari","Sassuolo","Lecce","Sassuolo","Lecce","+","+"]
["Cagliari","Sassuolo","Lecce","Sassuolo","Lecce"]
[22,10,11,5,5,"-","-"]
[4,3,0,1,0]
[6,2,5,2,1,"-","-"]
[12,5,6,2,4]
["21:38:00","13:15:00","09:16:00","06:07:00","02:07:00","+","-"]
[-17,-2,-7,-1,-5,"19.","19."]
[18,11,5,5,1,"Juventus","Lecce"]
[null,null,null,null,null,"Juventus","Lecce"]
["?","?","?","?","?",11,11]
[null,null,null,null,null,3,4]
["P","V","P","V","P",8,7]
[null,null,null,null,null,"17:05:00","09:16:00"]
["P","P","P","P","P",2,"2.3"]
[]
["V","P","P","P","P","?","?"]
[]
["N","N","P","N","P","-","+"]
[]
["N","N","N","N","N","+","-"]
["18.","18.","18.","18.","18."]
["Verona","Udinese","Verona","Empoli","Cagliari","-","-"]
["Verona","Udinese","Verona","Empoli","Cagliari"]
[23,12,12,5,5,"-","-"]
[4,1,1,1,0]
[6,7,2,2,1,"-","-"]
[13,4,9,2,4,"20.","20."]
["21:32:00","15:19:00","09:18:00","04:06:00","03:09:00","Lazio","Torino"]
[-11,-4,-9,-2,-6,"Lazio","Torino"]
[18,10,5,5,1,11,11]
[null,null,null,null,null,2,3]
["?","?","?","?","?",9,8]
[null,null,null,null,null,"12:07:00","08:13:00"]
["P","N","P","N","P","1.7","1.9"]
[]
["N","P","P","V","N","?","?"]
[]
["P","P","P","P","P","-","+"]
[]
["V","V","P","P","P","-","-"]
[]
["P","N","N","N","P","+","-"]
["19.","19.","19.","19.","19."]
["Empoli","Empoli","Cagliari","Frosinone","Sassuolo","-","-"]
["Empoli","Empoli","Cagliari","Frosinone","Sassuolo"]
[23,12,11,5,5,"-","-"]
[4,2,0,1,0]
[6,3,3,1,1]
[13,7,8,3,4]
["15:36:00","08:17:00","07:20:00","08:09:00","04:11:00"]
[-21,-9,-13,-1,-7]
[18,9,3,4,1]
[]
["?","?","?","?","?"]
[]
["N","N","P","P","P"]
[]
["N","V","N","V","P"]
[]
["V","P","P","P","P"]
[]
["P","P","P","P","P"]
[]
["P","N","P","N","N"]
["20.","20.","20.","20.","20."]
["Salernitana","Salernitana","Frosinone","Salernitana","Frosinone"]
["Salernitana","Salernitana","Frosinone","Salernitana","Frosinone"]
[23,12,11,5,5]
[2,1,0,0,0]
[7,4,3,1,1]
[14,7,8,4,4]
["19:44:00","12:24:00","09:25:00","06:10:00","04:14:00"]
[-25,-12,-16,-4,-10]
[13,7,3,1,1]
[]
["?","?","?","?","?"]
[]
["N","P","N","P","N"]
[]
["P","P","P","P","P"]
[]
["P","P","P","P","P"]
[]
["P","N","P","N","P"]
[]
["P","P","P","P","P"]

{"sheet":"Open","index":1,"n_rows":35,"n_cols":23,"rows_kept":35,"cut":false,"hidden":false,"merged":[[1,8,1,15],[4,18,5,22],[30,3,30,15]]}
[{"$f":"+Table!A4","v":"Inter"},{"$f":"IF(A1=0,\"\",A1)","v":"Inter"}]
[{"$f":"+Table!A27","v":"Juventus"},"Juventus",null,"Inter","vs","Atalanta",null,null,"AI DIRE SOCCER"]
[{"$f":"+Table!A49","v":"Milan"},"Milan"]
[{"$f":"+Table!A71","v":"Atalanta"},"Atalanta"]
[{"$f":"+Table!A93","v":"Bologna"},"Bologna",null,{"$f":"+'Elaboration data'!B8","v":57},"POINT",{"$f":"+'Elaboration data'!C8","v":39},null,null,"Over 0,5",null,"Over 1,5",null,"Over 2,5",null,"Over 3,5",null,null,null,"PICCHETTO"]
[{"$f":"+Table!A115","v":"Roma"},"Roma"]
[{"$f":"+Table!A137","v":"Napoli"},"Napoli",null,{"$f":"+'Elaboration data'!B4","v":18},"W",{"$f":"+'Elaboration data'!C4","v":12},null,null,{"$f":"+'Elaboration data'!AH15","v":0.94766819521348999},null,{"$f":"+'Elaboration data'!AH16","v":0.90054124649947886},null,{"$f":"+'Elaboration data'!AN46","v":0.4},null,{"$f":"+'Elaboration data'!AH18","v":0.39274115372608726}]
[{"$f":"+Table!A159","v":"Fiorentina"},"Fiorentina",null,{"$f":"+'Elaboration data'!B5","v":3},"N",{"$f":"+'Elaboration data'!C5","v":3},null,null,null,null,null,null,null,null,null,null,null,null,1,null,"X",null,2]
[{"$f":"+Table!A181","v":"Lazio"},"Lazio",null,{"$f":"+'Elaboration data'!B6","v":1},"P",{"$f":"+'Elaboration data'!C6","v":7},null,null,"Under 0,5",null,"Under 1,5",null,"Under 2,5",null,"Under 3,5",null,null,null,{"$f":"+'Elaboration data'!AK6","v":0.55421686746987953},null,{"$f":"+'Elaboration data'!AL6","v":0.2289156626506024},null,{"$f":"+'Elaboration data'!AM6","v":0.21686746987951808}]
[{"$f":"+Table!A203","v":"Torino"},"Torino"]
[{"$f":"+Table!A225","v":"Genoa"},"Genoa",null,null,null,null,null,null,{"$f":"100%-I7","v":5.2331804786510006E-2},null,{"$f":"100%-K7","v":9.9458753500521135E-2},null,{"$f":"100%-M7","v":0.6},null,{"$f":"100%-O7","v":0.6072588462739128}]
[{"$f":"+Table!A247","v":"Monza"},"Monza"]
[{"$f":"+Table!A269","v":"Lecce"},"Lecce"]
[{"$f":"+Table!A291","v":"Frosinone"},"Frosinone"]
[{"$f":"+Table!A313","v":"Sassuolo"},"Sassuolo"]
[{"$f":"+Table!A335","v":"Udinese"},"Udinese"]
[{"$f":"+Table!A357","v":"Cagliari"},"Cagliari",null,{"$f":"+D2","v":"Inter"},null,{"$f":"+F2","v":"Atalanta"}]
[{"$f":"+Table!A379","v":"Verona"},"Verona"]
[{"$f":"+Table!A401","v":"Empoli"},"Empoli"]
[{"$f":"+Table!A423","v":"Salernitana"},"Salernitana"]
[{"$f":"+Table!A455","v":0},"",null,null,null,null,null,null,null,null,"Official",null,"Alternative",null,"Surprise"]
[{"$f":"+Table!A467","v":0},""]
[{"$f":"+Table!A489","v":0},"",null,null,null,null,null,null,{"$f":"+D2","v":"Inter"},null,{"$f":"+'Elaboration data'!AH9","v":1.5882575757575759},null,{"$f":"+'Elaboration data'!AH26","v":1.8492063492063491},null,{"$f":"+('Elaboration data'!AH9/'Elaboration data'!AI9)*RANDBETWEEN(0,2)","v":2.3517644309418095}]
[{"$f":"+Table!A511","v":0},""]
[]
[null,null,null,null,null,null,null,null,{"$f":"+F2","v":"Atalanta"},null,{"$f":"+'Elaboration data'!AI9","v":0.6753472222222221},null,{"$f":"+'Elaboration data'!AI26","v":1.7777777777777779},null,{"$f":"+('Elaboration data'!AI9/'Elaboration data'!AH9)*RANDBETWEEN(0,2)","v":0.85042531202798288}]
[]
[]
[]
[]
[null,null,null,"Andamento Over/Under"]
[]
[null,null,null,{"$f":"+D2","v":"Inter"},null,null,{"$f":"+'Elaboration data'!AH52","v":"UNDER"},null,{"$f":"+'Elaboration data'!AH53","v":"OVER"},null,{"$f":"+'Elaboration data'!AH54","v":"UNDER"},null,{"$f":"+'Elaboration data'!AH55","v":"OVER"},null,{"$f":"+'Elaboration data'!AH56","v":"UNDER"}]
[]
[null,null,null,{"$f":"+F2","v":"Atalanta"},null,null,{"$f":"+'Elaboration data'!AI52","v":"UNDER"},null,{"$f":"+'Elaboration data'!AI53","v":"UNDER"},null,{"$f":"+'Elaboration data'!AI54","v":"OVER"},null,{"$f":"+'Elaboration data'!AI55","v":"UNDER"},null,{"$f":"+'Elaboration data'!AI56","v":"OVER"}]

{"sheet":"Elaboration data","index":2,"n_rows":90,"n_cols":43,"rows_kept":90,"cut":false,"hidden":true,"merged":[[75,0,75,2],[84,0,84,2],[60,0,60,2],[10,0,10,2],[19,0,19,2],[28,0,28,2],[37,0,37,2],[46,0,46,2]]}
[null,{"$f":"+Open!D2","v":"Inter"},{"$f":"+Open!F2","v":"Atalanta"},null,null,null,null,null,null,null,null,null,null,null,null,null,null,null,null,null,null,null,null,null,null,null,null,null,null,{"$f":"+A1","v":0},{"$f":"+B1","v":"Inter"},"Atalanta"]
[null,null,null,null,null,null,null,null,null,null,null,null,null,null,null,null,null,null,null,null,null,null,null,null,null,null,null,null,null,{"$f":"+A2","v":0},{"$f":"+B2","v":0},{"$f":"+C2","v":0}]
["Match",{"$f":"HLOOKUP(B1,E3:AB10,2,FALSE)","v":22},{"$f":"HLOOKUP(C1,E3:AB10,2,FALSE)","v":22},null,{"$f":"+Table!A4","v":"Inter"},{"$f":"+Table!A27","v":"Juventus"},{"$f":"+Table!A49","v":"Milan"},{"$f":"+Table!A71","v":"Atalanta"},{"$f":"+Table!A93","v":"Bologna"},{"$f":"+Table!A115","v":"Roma"},{"$f":"+Table!A137","v":"Napoli"},{"$f":"+Table!A159","v":"Fiorentina"},{"$f":"+Table!A181","v":"Lazio"},{"$f":"+Table!A203","v":"Torino"},{"$f":"+Table!A225","v":"Genoa"},{"$f":"+Table!A247","v":"Monza"},{"$f":"+Table!A269","v":"Lecce"},{"$f":"+Table!A291","v":"Frosinone"},{"$f":"+Table!A313","v":"Sassuolo"},{"$f":"+Table!A335","v":"Udinese"},{"$f":"+Table!A357","v":"Cagliari"},{"$f":"+Table!A379","v":"Verona"},{"$f":"+Table!A401","v":"Empoli"},{"$f":"+Table!A423","v":"Salernitana"},{"$f":"+Table!A445","v":0},{"$f":"+Table!A467","v":0},{"$f":"+Table!A489","v":0},{"$f":"+Table!A511","v":0},null,"Match",22,22,null,"Over","Under",null,1,2,"X"]
["Winner",{"$f":"HLOOKUP(B1,E3:AB10,3,FALSE)","v":18},{"$f":"HLOOKUP(C1,E3:AB10,3,FALSE)","v":12},null,{"$f":"+Table!A6","v":22},{"$f":"+Table!A28","v":23},{"$f":"+Table!A50","v":23},{"$f":"+Table!A72","v":22},{"$f":"+Table!A94","v":22},{"$f":"+Table!A116","v":22},{"$f":"+Table!A138","v":22},{"$f":"+Table!A160","v":22},{"$f":"+Table!A182","v":22},{"$f":"+Table!A204","v":22},{"$f":"+Table!A226","v":23},{"$f":"+Table!A248","v":23},{"$f":"+Table!A270","v":23},{"$f":"+Table!A292","v":23},{"$f":"+Table!A314","v":22},{"$f":"+Table!A336","v":23},{"$f":"+Table!A358","v":22},{"$f":"+Table!A380","v":23},{"$f":"+Table!A402","v":23},{"$f":"+Table!A424","v":23},{"$f":"+Table!A446","v":0},{"$f":"+Table!A468","v":0},{"$f":"+Table!A490","v":0},{"$f":"+Table!A512","v":0},null,"Winner",18,12,null,null,null,null,{"$f":"+AE4+AF6+AE13+AF24+AE31+AF41","v":46},{"$f":"+AF4+AE6+AF22+AE15+AF40+AE33","v":18},{"$f":"+AE5+AF5+AE13+AF23+AE32+AF41","v":19}]
["N",{"$f":"HLOOKUP(B1,E3:AB10,4,FALSE)","v":3},{"$f":"HLOOKUP(C1,E3:AB10,4,FALSE)","v":3},null,{"$f":"+Table!A7","v":18},{"$f":"+Table!A29","v":16},{"$f":"+Table!A51","v":15},{"$f":"+Table!A73","v":12},{"$f":"+Table!A95","v":9},{"$f":"+Table!A117","v":10},{"$f":"+Table!A139","v":10},{"$f":"+Table!A161","v":10},{"$f":"+Table!A183","v":10},{"$f":"+Table!A205","v":8},{"$f":"+Table!A227","v":7},{"$f":"+Table!A249","v":7},{"$f":"+Table!A271","v":5},{"$f":"+Table!A293","v":6},{"$f":"+Table!A315","v":5},{"$f":"+Table!A337","v":2},{"$f":"+Table!A359","v":4},{"$f":"+Table!A381","v":4},{"$f":"+Table!A403","v":4},{"$f":"+Table!A425","v":2},{"$f":"+Table!A447","v":0},{"$f":"+Table!A469","v":0},{"$f":"+Table!A491","v":0},{"$f":"+Table!A513","v":0},null,"N",3,3,null,{"$f":"+(AE34+AE16)/2","v":0.77326388888888897},{"$f":"+(AF25+AF43)/2","v":0.38194444444444442},null,1,"X",2]
["Lose",{"$f":"HLOOKUP(B1,E3:AB10,5,FALSE)","v":1},{"$f":"HLOOKUP(C1,E3:AB10,5,FALSE)","v":7},null,{"$f":"+Table!A8","v":3},{"$f":"+Table!A30","v":5},{"$f":"+Table!A52","v":4},{"$f":"+Table!A74","v":3},{"$f":"+Table!A96","v":9},{"$f":"+Table!A118","v":5},{"$f":"+Table!A140","v":5},{"$f":"+Table!A162","v":4},{"$f":"+Table!A184","v":4},{"$f":"+Table!A206","v":8},{"$f":"+Table!A228","v":8},{"$f":"+Table!A250","v":8},{"$f":"+Table!A272","v":9},{"$f":"+Table!A294","v":5},{"$f":"+Table!A316","v":4},{"$f":"+Table!A338","v":13},{"$f":"+Table!A360","v":6},{"$f":"+Table!A382","v":6},{"$f":"+Table!A404","v":6},{"$f":"+Table!A426","v":7},{"$f":"+Table!A448","v":0},{"$f":"+Table!A470","v":0},{"$f":"+Table!A492","v":0},{"$f":"+Table!A514","v":0},null,"Lose",1,7,null,null,null,null,{"$f":"+AK4/(AK4+AL4+AM4)","v":0.55421686746987953},{"$f":"+AM4/(AK4+AL4+AM4)","v":0.2289156626506024},{"$f":"+AL4/(AK4+AL4+AM4)","v":0.21686746987951808}]
["MediaG",{"$f":"HLOOKUP(B1,E3:AB10,6,FALSE)","v":2.1319444444444442},{"$f":"HLOOKUP(C1,E3:AB10,6,FALSE)","v":1.6819444444444445},null,{"$f":"+Table!A9","v":1},{"$f":"+Table!A31","v":2},{"$f":"+Table!A53","v":4},{"$f":"+Table!A75","v":7},{"$f":"+Table!A97","v":4},{"$f":"+Table!A119","v":7},{"$f":"+Table!A141","v":7},{"$f":"+Table!A163","v":8},{"$f":"+Table!A185","v":8},{"$f":"+Table!A207","v":6},{"$f":"+Table!A229","v":8},{"$f":"+Table!A251","v":8},{"$f":"+Table!A273","v":9},{"$f":"+Table!A295","v":12},{"$f":"+Table!A317","v":13},{"$f":"+Table!A339","v":8},{"$f":"+Table!A361","v":12},{"$f":"+Table!A383","v":13},{"$f":"+Table!A405","v":13},{"$f":"+Table!A427","v":14},{"$f":"+Table!A449","v":0},{"$f":"+Table!A471","v":0},{"$f":"+Table!A493","v":0},{"$f":"+Table!A515","v":0},null,"MediaG",2.1319444444444442,1.6819444444444445,null,{"$f":"+AH5/(AH5+AI5)","v":0.66937180643222127},{"$f":"+AI5/(AH5+AI5)","v":0.33062819356777873}]
["Point",{"$f":"HLOOKUP(B1,E3:AB10,8,FALSE)","v":57},{"$f":"HLOOKUP(C1,E3:AB10,8,FALSE)","v":39},null,{"$f":"+Table!A10","v":2.1319444444444442},{"$f":"+Table!A32","v":1.5097222222222222},{"$f":"+Table!A54","v":1.9354166666666668},{"$f":"+Table!A76","v":1.6819444444444445},{"$f":"+Table!A98","v":1.2236111111111112},{"$f":"+Table!A120","v":1.5180555555555555},{"$f":"+Table!A142","v":1.3513888888888888},{"$f":"+Table!A164","v":1.3090277777777779},{"$f":"+Table!A186","v":1.0576388888888888},{"$f":"+Table!A208","v":0.84652777777777777},{"$f":"+Table!A230","v":1.0180555555555555},{"$f":"+Table!A252","v":0.89444444444444438},{"$f":"+Table!A274","v":1.0229166666666667},{"$f":"+Table!A296","v":1.3222222222222222},{"$f":"+Table!A318","v":1.195138888888889},{"$f":"+Table!A340","v":0.98402777777777783},{"$f":"+Table!A362","v":0.90138888888888891},{"$f":"+Table!A384","v":0.89722222222222225},{"$f":"+Table!A406","v":0.65},{"$f":"+Table!A428","v":0.8222222222222223},{"$f":"+Table!A450","v":0},{"$f":"+Table!A472","v":0},{"$f":"+Table!A494","v":0},{"$f":"+Table!A516","v":0},null,"Point",57,39]
["Diff.Reti",{"$f":"HLOOKUP(B1,E3:AB10,7,FALSE)","v":41},{"$f":"HLOOKUP(C1,E3:AB10,7,FALSE)","v":18},null,{"$f":"+Table!A11","v":41},{"$f":"+Table!A33","v":22},{"$f":"+Table!A55","v":19},{"$f":"+Table!A77","v":18},{"$f":"+Table!A99","v":7},{"$f":"+Table!A121","v":10},{"$f":"+Table!A143","v":6},{"$f":"+Table!A165","v":6},{"$f":"+Table!A187","v":2},{"$f":"+Table!A209","v":1},{"$f":"+Table!A231","v":-2},{"$f":"+Table!A253","v":-7},{"$f":"+Table!A275","v":-9},{"$f":"+Table!A297","v":-13},{"$f":"+Table!A319","v":-13},{"$f":"+Table!A341","v":-14},{"$f":"+Table!A363","v":-17},{"$f":"+Table!A385","v":-11},{"$f":"+Table!A407","v":-21},{"$f":"+Table!A429","v":-25},{"$f":"+Table!A451","v":0},{"$f":"+Table!A473","v":0},{"$f":"+Table!A495","v":0},{"$f":"+Table!A517","v":0},null,"Diff.Reti",41,18,null,{"$f":"+(AE16+AE34*(E49/AE48))","v":1.5882575757575759},{"$f":"+(AF25+AF43*(AF49/AF48))","v":0.6753472222222221},null,{"$f":"+B77","v":"V"},{"$f":"+C86","v":"N"},{"$f":"IF(AK9=\"V\",3,IF(AK9=\"N\",1,0))","v":3},{"$f":"IF(AL9=\"V\",3,IF(AL9=\"N\",1,0))","v":1},null,{"$f":"+AM13","v":3},{"$f":"+AN13","v":3}]
[null,null,null,null,{"$f":"+Table!A12","v":57},{"$f":"+Table!A34","v":53},{"$f":"+Table!A56","v":49},{"$f":"+Table!A78","v":39},{"$f":"+Table!A100","v":36},{"$f":"+Table!A122","v":35},{"$f":"+Table!A144","v":35},{"$f":"+Table!A166","v":34},{"$f":"+Table!A188","v":34},{"$f":"+Table!A210","v":32},{"$f":"+Table!A232","v":29},{"$f":"+Table!A254","v":29},{"$f":"+Table!A276","v":24},{"$f":"+Table!A298","v":23},{"$f":"+Table!A320","v":19},{"$f":"+Table!A342","v":19},{"$f":"+Table!A364","v":18},{"$f":"+Table!A386","v":18},{"$f":"+Table!A408","v":18},{"$f":"+Table!A430","v":13},{"$f":"+Table!A452","v":0},{"$f":"+Table!A474","v":0},{"$f":"+Table!A496","v":0},{"$f":"+Table!A518","v":0},null,0,0,0,null,null,null,null,{"$f":"+B78","v":"V"},{"$f":"+C87","v":"P"},{"$f":"IF(AK10=\"V\",3,IF(AK10=\"N\",1,0))","v":3},{"$f":"IF(AL10=\"V\",3,IF(AL10=\"N\",1,0))","v":0},null,{"$f":"+AM12+AP9","v":6},{"$f":"+AN12+AQ9","v":4}]
["HOME",null,null,null,null,null,null,null,null,null,null,null,null,null,null,null,null,null,null,null,null,null,null,null,null,null,null,null,null,"HOME",0,0,null,{"$f":"+AH9/(AH9+AI9)","v":0.70164967717644444},{"$f":"+AI9/(AH9+AI9)","v":0.29835032282355561},null,"V","P",3,0,null,{"$f":"+AM11+AP10","v":9},{"$f":"+AN11+AQ10","v":4}]
["Match",{"$f":"HLOOKUP(B1,E12:AB19,2,FALSE)","v":11},{"$f":"HLOOKUP(C1,E12:AB19,2,FALSE)","v":12},null,{"$f":"+Table!B5","v":"Inter"},{"$f":"+Table!B27","v":"Atalanta"},{"$f":"+Table!B49","v":"Juventus"},{"$f":"+Table!B71","v":"Bologna"},{"$f":"+Table!B93","v":"Milan"},{"$f":"+Table!B115","v":"Roma"},{"$f":"+Table!B137","v":"Lazio"},{"$f":"+Table!B159","v":"Fiorentina"},{"$f":"+Table!B181","v":"Torino"},{"$f":"+Table!B203","v":"Frosinone"},{"$f":"+Table!B225","v":"Lecce"},{"$f":"+Table!B247","v":"Genoa"},{"$f":"+Table!B269","v":"Napoli"},{"$f":"+Table!B291","v":"Monza"},{"$f":"+Table!B313","v":"Cagliari"},{"$f":"+Table!B335","v":"Verona"},{"$f":"+Table!B357","v":"Sassuolo"},{"$f":"+Table!B379","v":"Udinese"},{"$f":"+Table!B401","v":"Empoli"},{"$f":"+Table!B423","v":"Salernitana"},{"$f":"+Table!B445","v":0},{"$f":"+Table!B467","v":0},{"$f":"+Table!B489","v":0},{"$f":"+Table!B511","v":0},null,"Match",11,12,null,null,null,null,"V","N",3,1,null,{"$f":"+AM10+AP11","v":12},{"$f":"+AN10+AQ11","v":4}]
["Winner",{"$f":"HLOOKUP(B1,E12:AB19,3,FALSE)","v":9},{"$f":"HLOOKUP(C1,E12:AB19,3,FALSE)","v":9},null,{"$f":"+Table!B6","v":11},{"$f":"+Table!B28","v":12},{"$f":"+Table!B50","v":11},{"$f":"+Table!B72","v":11},{"$f":"+Table!B94","v":11},{"$f":"+Table!B116","v":11},{"$f":"+Table!B138","v":11},{"$f":"+Table!B160","v":11},{"$f":"+Table!B182","v":11},{"$f":"+Table!B204","v":12},{"$f":"+Table!B226","v":12},{"$f":"+Table!B248","v":11},{"$f":"+Table!B270","v":11},{"$f":"+Table!B292","v":11},{"$f":"+Table!B314","v":11},{"$f":"+Table!B336","v":11},{"$f":"+Table!B358","v":10},{"$f":"+Table!B380","v":12},{"$f":"+Table!B402","v":12},{"$f":"+Table!B424","v":12},{"$f":"+Table!B446","v":0},{"$f":"+Table!B468","v":0},{"$f":"+Table!B490","v":0},{"$f":"+Table!B512","v":0},null,"Winner",9,9,null,{"$f":"+AH9+AI9","v":2.2636047979797977},null,null,"V","V",3,3,null,{"$f":"+AM9+AP12","v":15},{"$f":"+AN9+AQ12","v":5}]
["N",{"$f":"HLOOKUP(B1,E12:AB19,4,FALSE)","v":1},{"$f":"HLOOKUP(C1,E12:AB19,4,FALSE)","v":1},null,{"$f":"+Table!B7","v":9},{"$f":"+Table!B29","v":9},{"$f":"+Table!B51","v":8},{"$f":"+Table!B73","v":8},{"$f":"+Table!B95","v":8},{"$f":"+Table!B117","v":7},{"$f":"+Table!B139","v":6},{"$f":"+Table!B161","v":6},{"$f":"+Table!B183","v":5},{"$f":"+Table!B205","v":6},{"$f":"+Table!B227","v":5},{"$f":"+Table!B249","v":4},{"$f":"+Table!B271","v":5},{"$f":"+Table!B293","v":4},{"$f":"+Table!B315","v":4},{"$f":"+Table!B337","v":3},{"$f":"+Table!B359","v":3},{"$f":"+Table!B381","v":1},{"$f":"+Table!B403","v":2},{"$f":"+Table!B425","v":1},{"$f":"+Table!B447","v":0},{"$f":"+Table!B469","v":0},{"$f":"+Table!B491","v":0},{"$f":"+Table!B513","v":0},null,"N",1,1]
["Lose",{"$f":"HLOOKUP(B1,E12:AB19,5,FALSE)","v":1},{"$f":"HLOOKUP(C1,E12:AB19,5,FALSE)","v":2},null,{"$f":"+Table!B8","v":1},{"$f":"+Table!B30","v":1},{"$f":"+Table!B52","v":3},{"$f":"+Table!B74","v":2},{"$f":"+Table!B96","v":1},{"$f":"+Table!B118","v":3},{"$f":"+Table!B140","v":3},{"$f":"+Table!B162","v":2},{"$f":"+Table!B184","v":5},{"$f":"+Table!B206","v":2},{"$f":"+Table!B228","v":4},{"$f":"+Table!B250","v":5},{"$f":"+Table!B272","v":2},{"$f":"+Table!B294","v":4},{"$f":"+Table!B316","v":3},{"$f":"+Table!B338","v":4},{"$f":"+Table!B360","v":2},{"$f":"+Table!B382","v":7},{"$f":"+Table!B404","v":3},{"$f":"+Table!B426","v":4},{"$f":"+Table!B448","v":0},{"$f":"+Table!B470","v":0},{"$f":"+Table!B492","v":0},{"$f":"+Table!B514","v":0},null,"Lose",1,2,null,{"$f":"+AH13/(AH13+AI15)","v":0.94766819521348999},0.125]
["MediaG",{"$f":"HLOOKUP(B1,E12:AB19,6,FALSE)","v":1.0875000000000001},{"$f":"HLOOKUP(C1,E12:AB19,6,FALSE)","v":1.1305555555555555},null,{"$f":"+Table!B9","v":1},{"$f":"+Table!B31","v":2},{"$f":"+Table!B53","v":0},{"$f":"+Table!B75","v":1},{"$f":"+Table!B97","v":2},{"$f":"+Table!B119","v":1},{"$f":"+Table!B141","v":2},{"$f":"+Table!B163","v":3},{"$f":"+Table!B185","v":1},{"$f":"+Table!B207","v":4},{"$f":"+Table!B229","v":3},{"$f":"+Table!B251","v":2},{"$f":"+Table!B273","v":4},{"$f":"+Table!B295","v":3},{"$f":"+Table!B317","v":4},{"$f":"+Table!B339","v":4},{"$f":"+Table!B361","v":5},{"$f":"+Table!B383","v":4},{"$f":"+Table!B405","v":7},{"$f":"+Table!B427","v":7},{"$f":"+Table!B449","v":0},{"$f":"+Table!B471","v":0},{"$f":"+Table!B493","v":0},{"$f":"+Table!B515","v":0},null,"MediaG",1.0875000000000001,1.1305555555555555,null,{"$f":"+AH13/(AH13+AI16)","v":0.90054124649947886},0.25]
["Point",{"$f":"HLOOKUP(B1,E12:AB19,8,FALSE)","v":28},{"$f":"HLOOKUP(C1,E12:AB19,8,FALSE)","v":28},null,{"$f":"+Table!B10","v":1.0875000000000001},{"$f":"+Table!B32","v":1.1305555555555555},{"$f":"+Table!B54","v":0.71180555555555547},{"$f":"+Table!B76","v":0.75486111111111109},{"$f":"+Table!B98","v":0.83819444444444446},{"$f":"+Table!B120","v":1.0062499999999999},{"$f":"+Table!B142","v":0.50486111111111109},{"$f":"+Table!B164","v":0.71597222222222223},{"$f":"+Table!B186","v":0.50416666666666665},{"$f":"+Table!B208","v":0.92986111111111114},{"$f":"+Table!B230","v":0.63680555555555551},{"$f":"+Table!B252","v":0.59166666666666667},{"$f":"+Table!B274","v":0.67708333333333337},{"$f":"+Table!B296","v":0.50763888888888886},{"$f":"+Table!B318","v":0.59583333333333333},{"$f":"+Table!B340","v":0.50972222222222219},{"$f":"+Table!B362","v":0.55208333333333337},{"$f":"+Table!B384","v":0.6381944444444444},{"$f":"+Table!B406","v":0.34513888888888888},{"$f":"+Table!B428","v":0.51666666666666672},{"$f":"+Table!B450","v":0},{"$f":"+Table!B472","v":0},{"$f":"+Table!B494","v":0},{"$f":"+Table!B516","v":0},null,"Point",28,28,null,{"$f":"+AH13/(AH13+AI17)","v":0.69359035119110946},1]
["Diff.Reti",{"$f":"HLOOKUP(B1,E12:AB19,7,FALSE)","v":20},{"$f":"HLOOKUP(C1,E12:AB19,7,FALSE)","v":19},null,{"$f":"+Table!B11","v":20},{"$f":"+Table!B33","v":19},{"$f":"+Table!B55","v":12},{"$f":"+Table!B77","v":11},{"$f":"+Table!B99","v":13},{"$f":"+Table!B121","v":15},{"$f":"+Table!B143","v":5},{"$f":"+Table!B165","v":6},{"$f":"+Table!B187","v":6},{"$f":"+Table!B209","v":3},{"$f":"+Table!B231","v":-2},{"$f":"+Table!B253","v":2},{"$f":"+Table!B275","v":1},{"$f":"+Table!B297","v":1},{"$f":"+Table!B319","v":-4},{"$f":"+Table!B341","v":-2},{"$f":"+Table!B363","v":-2},{"$f":"+Table!B385","v":-4},{"$f":"+Table!B407","v":-9},{"$f":"+Table!B429","v":-12},{"$f":"+Table!B451","v":0},{"$f":"+Table!B473","v":0},{"$f":"+Table!B495","v":0},{"$f":"+Table!B517","v":0},null,"Diff.Reti",20,19,null,{"$f":"+AH13/(AH13+AI18)","v":0.39274115372608726},3.5]
[null,null,null,null,{"$f":"+Table!B12","v":28},{"$f":"+Table!B34","v":28},{"$f":"+Table!B56","v":27},{"$f":"+Table!B78","v":26},{"$f":"+Table!B100","v":25},{"$f":"+Table!B122","v":24},{"$f":"+Table!B144","v":21},{"$f":"+Table!B166","v":20},{"$f":"+Table!B188","v":20},{"$f":"+Table!B210","v":20},{"$f":"+Table!B232","v":19},{"$f":"+Table!B254","v":17},{"$f":"+Table!B276","v":17},{"$f":"+Table!B298","v":16},{"$f":"+Table!B320","v":15},{"$f":"+Table!B342","v":13},{"$f":"+Table!B364","v":11},{"$f":"+Table!B386","v":10},{"$f":"+Table!B408","v":9},{"$f":"+Table!B430","v":7},{"$f":"+Table!B452","v":0},{"$f":"+Table!B474","v":0},{"$f":"+Table!B496","v":0},{"$f":"+Table!B518","v":0},null,0,0,0]
["Away",null,null,null,null,null,null,null,null,null,null,null,null,null,null,null,null,null,null,null,null,null,null,null,null,null,null,null,null,"Away",0,0,null,{"$f":"+AE4/AF4","v":1.5},{"$f":"+AF4/AE4","v":0.66666666666666663}]
["Match",{"$f":"HLOOKUP(B1,E21:AB28,2,FALSE)","v":11},{"$f":"HLOOKUP(C1,E21:AB28,2,FALSE)","v":10},null,{"$f":"+Table!C5","v":"Inter"},{"$f":"+Table!C27","v":"Juventus"},{"$f":"+Table!C49","v":"Milan"},{"$f":"+Table!C71","v":"Napoli"},{"$f":"+Table!C93","v":"Fiorentina"},{"$f":"+Table!C115","v":"Lazio"},{"$f":"+Table!C137","v":"Monza"},{"$f":"+Table!C159","v":"Torino"},{"$f":"+Table!C181","v":"Genoa"},{"$f":"+Table!C203","v":"Atalanta"},{"$f":"+Table!C225","v":"Roma"},{"$f":"+Table!C247","v":"Bologna"},{"$f":"+Table!C269","v":"Udinese"},{"$f":"+Table!C291","v":"Empoli"},{"$f":"+Table!C313","v":"Sassuolo"},{"$f":"+Table!C335","v":"Salernitana"},{"$f":"+Table!C357","v":"Lecce"},{"$f":"+Table!C379","v":"Verona"},{"$f":"+Table!C401","v":"Cagliari"},{"$f":"+Table!C423","v":"Frosinone"},{"$f":"+Table!C445","v":0},{"$f":"+Table!C467","v":0},{"$f":"+Table!C489","v":0},{"$f":"+Table!C511","v":0},null,"Match",11,10,null,{"$f":"+AE5/AF5","v":1},{"$f":"+AF5/AE5","v":1}]
["Winner",{"$f":"HLOOKUP(B1,E21:AB28,3,FALSE)","v":9},{"$f":"HLOOKUP(C1,E21:AB28,3,FALSE)","v":3},null,{"$f":"+Table!C6","v":11},{"$f":"+Table!C28","v":12},{"$f":"+Table!C50","v":12},{"$f":"+Table!C72","v":11},{"$f":"+Table!C94","v":11},{"$f":"+Table!C116","v":11},{"$f":"+Table!C138","v":12},{"$f":"+Table!C160","v":11},{"$f":"+Table!C182","v":12},{"$f":"+Table!C204","v":10},{"$f":"+Table!C226","v":11},{"$f":"+Table!C248","v":11},{"$f":"+Table!C270","v":11},{"$f":"+Table!C292","v":11},{"$f":"+Table!C314","v":12},{"$f":"+Table!C336","v":11},{"$f":"+Table!C358","v":11},{"$f":"+Table!C380","v":12},{"$f":"+Table!C402","v":11},{"$f":"+Table!C424","v":11},{"$f":"+Table!C446","v":0},{"$f":"+Table!C468","v":0},{"$f":"+Table!C490","v":0},{"$f":"+Table!C512","v":0},null,"Winner",9,3,null,{"$f":"+AE6/AF6","v":0.14285714285714285},{"$f":"+AF6/AE6","v":7}]
["N",{"$f":"HLOOKUP(B1,E21:AB28,4,FALSE)","v":2},{"$f":"HLOOKUP(C1,E21:AB28,4,FALSE)","v":2},null,{"$f":"+Table!C7","v":9},{"$f":"+Table!C29","v":8},{"$f":"+Table!C51","v":7},{"$f":"+Table!C73","v":5},{"$f":"+Table!C95","v":4},{"$f":"+Table!C117","v":4},{"$f":"+Table!C139","v":3},{"$f":"+Table!C161","v":3},{"$f":"+Table!C183","v":3},{"$f":"+Table!C205","v":3},{"$f":"+Table!C227","v":3},{"$f":"+Table!C249","v":1},{"$f":"+Table!C271","v":1},{"$f":"+Table!C293","v":2},{"$f":"+Table!C315","v":2},{"$f":"+Table!C337","v":1},{"$f":"+Table!C359","v":0},{"$f":"+Table!C381","v":1},{"$f":"+Table!C403","v":0},{"$f":"+Table!C425","v":0},{"$f":"+Table!C447","v":0},{"$f":"+Table!C469","v":0},{"$f":"+Table!C491","v":0},{"$f":"+Table!C513","v":0},null,"N",2,2]
["Lose",{"$f":"HLOOKUP(B1,E21:AB28,5,FALSE)","v":0},{"$f":"HLOOKUP(C1,E21:AB28,5,FALSE)","v":5},null,{"$f":"+Table!C8","v":2},{"$f":"+Table!C30","v":2},{"$f":"+Table!C52","v":3},{"$f":"+Table!C74","v":3},{"$f":"+Table!C96","v":2},{"$f":"+Table!C118","v":1},{"$f":"+Table!C140","v":4},{"$f":"+Table!C162","v":3},{"$f":"+Table!C184","v":3},{"$f":"+Table!C206","v":2},{"$f":"+Table!C228","v":2},{"$f":"+Table!C250","v":7},{"$f":"+Table!C272","v":6},{"$f":"+Table!C294","v":3},{"$f":"+Table!C316","v":2},{"$f":"+Table!C338","v":3},{"$f":"+Table!C360","v":5},{"$f":"+Table!C382","v":2},{"$f":"+Table!C404","v":3},{"$f":"+Table!C426","v":3},{"$f":"+Table!C448","v":0},{"$f":"+Table!C470","v":0},{"$f":"+Table!C492","v":0},{"$f":"+Table!C514","v":0},null,"Lose",0,5,null,{"$f":"+AH20*3+AH21+AH22/3","v":5.5476190476190474},{"$f":"+AI20*3+AI21+AI22/3","v":5.3333333333333339}]
["MediaG",{"$f":"HLOOKUP(B1,E21:AB28,6,FALSE)","v":1.0444444444444445},{"$f":"HLOOKUP(C1,E21:AB28,6,FALSE)","v":0.55138888888888882},null,{"$f":"+Table!C9","v":0},{"$f":"+Table!C31","v":2},{"$f":"+Table!C53","v":2},{"$f":"+Table!C75","v":3},{"$f":"+Table!C97","v":5},{"$f":"+Table!C119","v":6},{"$f":"+Table!C141","v":5},{"$f":"+Table!C163","v":5},{"$f":"+Table!C185","v":6},{"$f":"+Table!C207","v":5},{"$f":"+Table!C229","v":6},{"$f":"+Table!C251","v":3},{"$f":"+Table!C273","v":4},{"$f":"+Table!C295","v":6},{"$f":"+Table!C317","v":8},{"$f":"+Table!C339","v":7},{"$f":"+Table!C361","v":6},{"$f":"+Table!C383","v":9},{"$f":"+Table!C405","v":8},{"$f":"+Table!C427","v":8},{"$f":"+Table!C449","v":0},{"$f":"+Table!C471","v":0},{"$f":"+Table!C493","v":0},{"$f":"+Table!C515","v":0},null,"MediaG",1.0444444444444445,0.55138888888888882]
["Point",{"$f":"HLOOKUP(B1,E21:AB28,8,FALSE)","v":29},{"$f":"HLOOKUP(C1,E21:AB28,8,FALSE)","v":11},null,{"$f":"+Table!C10","v":1.0444444444444445},{"$f":"+Table!C32","v":0.79791666666666661},{"$f":"+Table!C54","v":1.0972222222222221},{"$f":"+Table!C76","v":0.6743055555555556},{"$f":"+Table!C98","v":0.59305555555555556},{"$f":"+Table!C120","v":0.55277777777777781},{"$f":"+Table!C142","v":0.38680555555555557},{"$f":"+Table!C164","v":0.34236111111111112},{"$f":"+Table!C186","v":0.42638888888888887},{"$f":"+Table!C208","v":0.55138888888888882},{"$f":"+Table!C230","v":0.51180555555555551},{"$f":"+Table!C252","v":0.46875},{"$f":"+Table!C274","v":0.34583333333333338},{"$f":"+Table!C296","v":0.30486111111111108},{"$f":"+Table!C318","v":0.6430555555555556},{"$f":"+Table!C340","v":0.30555555555555552},{"$f":"+Table!C362","v":0.38611111111111113},{"$f":"+Table!C384","v":0.38750000000000001},{"$f":"+Table!C406","v":0.30555555555555552},{"$f":"+Table!C428","v":0.3923611111111111},{"$f":"+Table!C450","v":0},{"$f":"+Table!C472","v":0},{"$f":"+Table!C494","v":0},{"$f":"+Table!C516","v":0},null,"Point",29,11,null,{"$f":"+AH24/3","v":1.8492063492063491},{"$f":"+AI24/3","v":1.7777777777777779}]
["Diff.Reti",{"$f":"HLOOKUP(B1,E21:AB28,7,FALSE)","v":21},{"$f":"HLOOKUP(C1,E21:AB28,7,FALSE)","v":-1},null,{"$f":"+Table!C11","v":21},{"$f":"+Table!C33","v":10},{"$f":"+Table!C55","v":6},{"$f":"+Table!C77","v":5},{"$f":"+Table!C99","v":0},{"$f":"+Table!C121","v":-3},{"$f":"+Table!C143","v":-8},{"$f":"+Table!C165","v":-5},{"$f":"+Table!C187","v":-4},{"$f":"+Table!C209","v":-1},{"$f":"+Table!C231","v":-5},{"$f":"+Table!C253","v":-4},{"$f":"+Table!C275","v":-10},{"$f":"+Table!C297","v":-12},{"$f":"+Table!C319","v":-11},{"$f":"+Table!C341","v":-13},{"$f":"+Table!C363","v":-7},{"$f":"+Table!C385","v":-9},{"$f":"+Table!C407","v":-13},{"$f":"+Table!C429","v":-16},{"$f":"+Table!C451","v":0},{"$f":"+Table!C473","v":0},{"$f":"+Table!C495","v":0},{"$f":"+Table!C517","v":0},null,"Diff.Reti",21,-1]
[null,null,null,null,{"$f":"+Table!C12","v":29},{"$f":"+Table!C34","v":26},{"$f":"+Table!C56","v":24},{"$f":"+Table!C78","v":18},{"$f":"+Table!C100","v":14},{"$f":"+Table!C122","v":13},{"$f":"+Table!C144","v":13},{"$f":"+Table!C166","v":12},{"$f":"+Table!C188","v":12},{"$f":"+Table!C210","v":11},{"$f":"+Table!C232","v":11},{"$f":"+Table!C254","v":10},{"$f":"+Table!C276","v":9},{"$f":"+Table!C298","v":9},{"$f":"+Table!C320","v":8},{"$f":"+Table!C342","v":6},{"$f":"+Table!C364","v":5},{"$f":"+Table!C386","v":5},{"$f":"+Table!C408","v":3},{"$f":"+Table!C430","v":3},{"$f":"+Table!C452","v":0},{"$f":"+Table!C474","v":0},{"$f":"+Table!C496","v":0},{"$f":"+Table!C518","v":0},null,0,0,0]
["Form Home 5",null,null,null,null,null,null,null,null,null,null,null,null,null,null,null,null,null,null,null,null,null,null,null,null,null,null,null,null,"Form Home 5",0,0]
["Match",{"$f":"HLOOKUP(B1,E30:AB37,2,FALSE)","v":5},{"$f":"HLOOKUP(C1,E30:AB37,2,FALSE)","v":5},null,{"$f":"+Table!D5","v":"Atalanta"},{"$f":"+Table!D27","v":"Inter"},{"$f":"+Table!D49","v":"Milan"},{"$f":"+Table!D71","v":"Bologna"},{"$f":"+Table!D93","v":"Torino"},{"$f":"+Table!D115","v":"Roma"},{"$f":"+Table!D137","v":"Juventus"},{"$f":"+Table!D159","v":"Fiorentina"},{"$f":"+Table!D181","v":"Lazio"},{"$f":"+Table!D203","v":"Napoli"},{"$f":"+Table!D225","v":"Verona"},{"$f":"+Table!D247","v":"Cagliari"},{"$f":"+Table!D269","v":"Lecce"},{"$f":"+Table!D291","v":"Genoa"},{"$f":"+Table!D313","v":"Monza"},{"$f":"+Table!D335","v":"Udinese"},{"$f":"+Table!D357","v":"Sassuolo"},{"$f":"+Table!D379","v":"Empoli"},{"$f":"+Table!D401","v":"Frosinone"},{"$f":"+Table!D423","v":"Salernitana"},{"$f":"+Table!D445","v":0},{"$f":"+Table!D467","v":0},{"$f":"+Table!D489","v":0},{"$f":"+Table!D511","v":0},null,"Match",5,5]
["Winner",{"$f":"HLOOKUP(B1,E30:AB37,3,FALSE)","v":5},{"$f":"HLOOKUP(C1,E30:AB37,3,FALSE)","v":5},null,{"$f":"+Table!D6","v":5},{"$f":"+Table!D28","v":5},{"$f":"+Table!D50","v":5},{"$f":"+Table!D72","v":5},{"$f":"+Table!D94","v":5},{"$f":"+Table!D116","v":5},{"$f":"+Table!D138","v":5},{"$f":"+Table!D160","v":5},{"$f":"+Table!D182","v":5},{"$f":"+Table!D204","v":5},{"$f":"+Table!D226","v":5},{"$f":"+Table!D248","v":5},{"$f":"+Table!D270","v":5},{"$f":"+Table!D292","v":5},{"$f":"+Table!D314","v":5},{"$f":"+Table!D336","v":5},{"$f":"+Table!D358","v":5},{"$f":"+Table!D380","v":5},{"$f":"+Table!D402","v":5},{"$f":"+Table!D424","v":5},{"$f":"+Table!D446","v":0},{"$f":"+Table!D468","v":0},{"$f":"+Table!D490","v":0},{"$f":"+Table!D512","v":0},null,"Winner",5,5]
["N",{"$f":"HLOOKUP(B1,E30:AB37,4,FALSE)","v":0},{"$f":"HLOOKUP(C1,E30:AB37,4,FALSE)","v":0},null,{"$f":"+Table!D7","v":5},{"$f":"+Table!D29","v":5},{"$f":"+Table!D51","v":4},{"$f":"+Table!D73","v":4},{"$f":"+Table!D95","v":3},{"$f":"+Table!D117","v":3},{"$f":"+Table!D139","v":3},{"$f":"+Table!D161","v":3},{"$f":"+Table!D183","v":3},{"$f":"+Table!D205","v":3},{"$f":"+Table!D227","v":2},{"$f":"+Table!D249","v":2},{"$f":"+Table!D271","v":2},{"$f":"+Table!D293","v":1},{"$f":"+Table!D315","v":2},{"$f":"+Table!D337","v":1},{"$f":"+Table!D359","v":1},{"$f":"+Table!D381","v":1},{"$f":"+Table!D403","v":1},{"$f":"+Table!D425","v":0},{"$f":"+Table!D447","v":0},{"$f":"+Table!D469","v":0},{"$f":"+Table!D491","v":0},{"$f":"+Table!D513","v":0},null,"N",0,0]
["Lose",{"$f":"HLOOKUP(B1,E30:AB37,5,FALSE)","v":0},{"$f":"HLOOKUP(C1,E30:AB37,5,FALSE)","v":0},null,{"$f":"+Table!D8","v":0},{"$f":"+Table!D30","v":0},{"$f":"+Table!D52","v":1},{"$f":"+Table!D74","v":1},{"$f":"+Table!D96","v":2},{"$f":"+Table!D118","v":2},{"$f":"+Table!D140","v":2},{"$f":"+Table!D162","v":1},{"$f":"+Table!D184","v":1},{"$f":"+Table!D206","v":1},{"$f":"+Table!D228","v":2},{"$f":"+Table!D250","v":2},{"$f":"+Table!D272","v":2},{"$f":"+Table!D294","v":4},{"$f":"+Table!D316","v":0},{"$f":"+Table!D338","v":2},{"$f":"+Table!D360","v":2},{"$f":"+Table!D382","v":2},{"$f":"+Table!D404","v":1},{"$f":"+Table!D426","v":1},{"$f":"+Table!D448","v":0},{"$f":"+Table!D470","v":0},{"$f":"+Table!D492","v":0},{"$f":"+Table!D514","v":0},null,"Lose",0,0]
["MediaG",{"$f":"HLOOKUP(B1,E30:AB37,6,FALSE)","v":0.45902777777777781},{"$f":"HLOOKUP(C1,E30:AB37,6,FALSE)","v":0.62638888888888888},null,{"$f":"+Table!D9","v":0},{"$f":"+Table!D31","v":0},{"$f":"+Table!D53","v":0},{"$f":"+Table!D75","v":0},{"$f":"+Table!D97","v":0},{"$f":"+Table!D119","v":0},{"$f":"+Table!D141","v":0},{"$f":"+Table!D163","v":1},{"$f":"+Table!D185","v":1},{"$f":"+Table!D207","v":1},{"$f":"+Table!D229","v":1},{"$f":"+Table!D251","v":1},{"$f":"+Table!D273","v":1},{"$f":"+Table!D295","v":0},{"$f":"+Table!D317","v":3},{"$f":"+Table!D339","v":2},{"$f":"+Table!D361","v":2},{"$f":"+Table!D383","v":2},{"$f":"+Table!D405","v":3},{"$f":"+Table!D427","v":4},{"$f":"+Table!D449","v":0},{"$f":"+Table!D471","v":0},{"$f":"+Table!D493","v":0},{"$f":"+Table!D515","v":0},null,"MediaG",0.45902777777777781,0.62638888888888888]
["Point",{"$f":"HLOOKUP(B1,E30:AB37,8,FALSE)","v":15},{"$f":"HLOOKUP(C1,E30:AB37,8,FALSE)","v":15},null,{"$f":"+Table!D10","v":0.62638888888888888},{"$f":"+Table!D32","v":0.45902777777777781},{"$f":"+Table!D54","v":0.50277777777777777},{"$f":"+Table!D76","v":0.41875000000000001},{"$f":"+Table!D98","v":0.33402777777777781},{"$f":"+Table!D120","v":0.37777777777777777},{"$f":"+Table!D142","v":0.29305555555555557},{"$f":"+Table!D164","v":0.29375000000000001},{"$f":"+Table!D186","v":0.21041666666666667},{"$f":"+Table!D208","v":0.25416666666666665},{"$f":"+Table!D230","v":0.25277777777777777},{"$f":"+Table!D252","v":0.25347222222222221},{"$f":"+Table!D274","v":0.29722222222222222},{"$f":"+Table!D296","v":0.21111111111111111},{"$f":"+Table!D318","v":0.17222222222222225},{"$f":"+Table!D340","v":0.33819444444444446},{"$f":"+Table!D362","v":0.25486111111111109},{"$f":"+Table!D384","v":0.17083333333333331},{"$f":"+Table!D406","v":0.33958333333333335},{"$f":"+Table!D428","v":0.25694444444444448},{"$f":"+Table!D450","v":0},{"$f":"+Table!D472","v":0},{"$f":"+Table!D494","v":0},{"$f":"+Table!D516","v":0},null,"Point",15,15]
["Rendimento",{"$f":"HLOOKUP(B1,E30:AB37,8,FALSE)","v":15},{"$f":"HLOOKUP(C1,E30:AB37,8,FALSE)","v":15},null,{"$f":"+Table!D11","v":13},{"$f":"+Table!D33","v":10},{"$f":"+Table!D55","v":8},{"$f":"+Table!D77","v":7},{"$f":"+Table!D99","v":7},{"$f":"+Table!D121","v":5},{"$f":"+Table!D143","v":5},{"$f":"+Table!D165","v":4},{"$f":"+Table!D187","v":2},{"$f":"+Table!D209","v":0},{"$f":"+Table!D231","v":2},{"$f":"+Table!D253","v":1},{"$f":"+Table!D275","v":-1},{"$f":"+Table!D297","v":1},{"$f":"+Table!D319","v":-4},{"$f":"+Table!D341","v":1},{"$f":"+Table!D363","v":-1},{"$f":"+Table!D385","v":-2},{"$f":"+Table!D407","v":-1},{"$f":"+Table!D429","v":-4},{"$f":"+Table!D451","v":0},{"$f":"+Table!D473","v":0},{"$f":"+Table!D495","v":0},{"$f":"+Table!D517","v":0},null,"Rendimento",15,15]
[null,null,null,null,{"$f":"+Table!D12","v":15},{"$f":"+Table!D34","v":15},{"$f":"+Table!D56","v":13},{"$f":"+Table!D78","v":13},{"$f":"+Table!D100","v":11},{"$f":"+Table!D122","v":11},{"$f":"+Table!D144","v":11},{"$f":"+Table!D166","v":10},{"$f":"+Table!D188","v":10},{"$f":"+Table!D210","v":10},{"$f":"+Table!D232","v":8},{"$f":"+Table!D254","v":8},{"$f":"+Table!D276","v":8},{"$f":"+Table!D298","v":7},{"$f":"+Table!D320","v":6},{"$f":"+Table!D342","v":5},{"$f":"+Table!D364","v":5},{"$f":"+Table!D386","v":5},{"$f":"+Table!D408","v":4},{"$f":"+Table!D430","v":1},{"$f":"+Table!D452","v":0},{"$f":"+Table!D474","v":0},{"$f":"+Table!D496","v":0},{"$f":"+Table!D518","v":0},null,0,0,0]
["Form Away 5",null,null,null,null,null,null,null,null,null,null,null,null,null,null,null,null,null,null,null,null,null,null,null,null,null,null,null,null,"Form Away 5",0,0]
["Match",{"$f":"HLOOKUP(B1,E39:AB46,2,FALSE)","v":5},{"$f":"HLOOKUP(C1,E39:AB46,2,FALSE)","v":5},null,{"$f":"+Table!E5","v":"Inter"},{"$f":"+Table!E27","v":"Milan"},{"$f":"+Table!E49","v":"Juventus"},{"$f":"+Table!E71","v":"Genoa"},{"$f":"+Table!E93","v":"Lazio"},{"$f":"+Table!E115","v":"Roma"},{"$f":"+Table!E137","v":"Atalanta"},{"$f":"+Table!E159","v":"Torino"},{"$f":"+Table!E181","v":"Bologna"},{"$f":"+Table!E203","v":"Monza"},{"$f":"+Table!E225","v":"Fiorentina"},{"$f":"+Table!E247","v":"Napoli"},{"$f":"+Table!E269","v":"Salernitana"},{"$f":"+Table!E291","v":"Empoli"},{"$f":"+Table!E313","v":"Udinese"},{"$f":"+Table!E335","v":"Verona"},{"$f":"+Table!E357","v":"Lecce"},{"$f":"+Table!E379","v":"Cagliari"},{"$f":"+Table!E401","v":"Sassuolo"},{"$f":"+Table!E423","v":"Frosinone"},{"$f":"+Table!E445","v":0},{"$f":"+Table!E467","v":0},{"$f":"+Table!E489","v":0},{"$f":"+Table!E511","v":0},null,"Match",5,5]
["Winner",{"$f":"HLOOKUP(B1,E39:AB46,3,FALSE)","v":4},{"$f":"HLOOKUP(C1,E39:AB46,3,FALSE)","v":1},null,{"$f":"+Table!E6","v":5},{"$f":"+Table!E28","v":5},{"$f":"+Table!E50","v":5},{"$f":"+Table!E72","v":5},{"$f":"+Table!E94","v":5},{"$f":"+Table!E116","v":5},{"$f":"+Table!E138","v":5},{"$f":"+Table!E160","v":5},{"$f":"+Table!E182","v":5},{"$f":"+Table!E204","v":5},{"$f":"+Table!E226","v":5},{"$f":"+Table!E248","v":5},{"$f":"+Table!E270","v":5},{"$f":"+Table!E292","v":5},{"$f":"+Table!E314","v":5},{"$f":"+Table!E336","v":5},{"$f":"+Table!E358","v":5},{"$f":"+Table!E380","v":5},{"$f":"+Table!E402","v":5},{"$f":"+Table!E424","v":5},{"$f":"+Table!E446","v":0},{"$f":"+Table!E468","v":0},{"$f":"+Table!E490","v":0},{"$f":"+Table!E512","v":0},null,"Winner",4,1]
["N",{"$f":"HLOOKUP(B1,E39:AB46,4,FALSE)","v":1},{"$f":"HLOOKUP(C1,E39:AB46,4,FALSE)","v":2},null,{"$f":"+Table!E7","v":4},{"$f":"+Table!E29","v":3},{"$f":"+Table!E51","v":3},{"$f":"+Table!E73","v":2},{"$f":"+Table!E95","v":2},{"$f":"+Table!E117","v":2},{"$f":"+Table!E139","v":1},{"$f":"+Table!E161","v":1},{"$f":"+Table!E183","v":1},{"$f":"+Table!E205","v":1},{"$f":"+Table!E227","v":1},{"$f":"+Table!E249","v":1},{"$f":"+Table!E271","v":1},{"$f":"+Table!E293","v":0},{"$f":"+Table!E315","v":0},{"$f":"+Table!E337","v":0},{"$f":"+Table!E359","v":0},{"$f":"+Table!E381","v":0},{"$f":"+Table!E403","v":0},{"$f":"+Table!E425","v":0},{"$f":"+Table!E447","v":0},{"$f":"+Table!E469","v":0},{"$f":"+Table!E491","v":0},{"$f":"+Table!E513","v":0},null,"N",1,2]
["Lose",{"$f":"HLOOKUP(B1,E39:AB46,5,FALSE)","v":0},{"$f":"HLOOKUP(C1,E39:AB46,5,FALSE)","v":2},null,{"$f":"+Table!E8","v":1},{"$f":"+Table!E30","v":1},{"$f":"+Table!E52","v":1},{"$f":"+Table!E74","v":2},{"$f":"+Table!E96","v":1},{"$f":"+Table!E118","v":0},{"$f":"+Table!E140","v":2},{"$f":"+Table!E162","v":2},{"$f":"+Table!E184","v":2},{"$f":"+Table!E206","v":2},{"$f":"+Table!E228","v":1},{"$f":"+Table!E250","v":1},{"$f":"+Table!E272","v":1},{"$f":"+Table!E294","v":3},{"$f":"+Table!E316","v":2},{"$f":"+Table!E338","v":1},{"$f":"+Table!E360","v":1},{"$f":"+Table!E382","v":1},{"$f":"+Table!E404","v":1},{"$f":"+Table!E426","v":1},{"$f":"+Table!E448","v":0},{"$f":"+Table!E470","v":0},{"$f":"+Table!E492","v":0},{"$f":"+Table!E514","v":0},null,"Lose",0,2]
["MediaG",{"$f":"HLOOKUP(B1,E39:AB46,6,FALSE)","v":0.50138888888888888},{"$f":"HLOOKUP(C1,E39:AB46,6,FALSE)","v":0.21249999999999999},null,{"$f":"+Table!E9","v":0},{"$f":"+Table!E31","v":1},{"$f":"+Table!E53","v":1},{"$f":"+Table!E75","v":1},{"$f":"+Table!E97","v":2},{"$f":"+Table!E119","v":3},{"$f":"+Table!E141","v":2},{"$f":"+Table!E163","v":2},{"$f":"+Table!E185","v":2},{"$f":"+Table!E207","v":2},{"$f":"+Table!E229","v":3},{"$f":"+Table!E251","v":3},{"$f":"+Table!E273","v":3},{"$f":"+Table!E295","v":2},{"$f":"+Table!E317","v":3},{"$f":"+Table!E339","v":4},{"$f":"+Table!E361","v":4},{"$f":"+Table!E383","v":4},{"$f":"+Table!E405","v":4},{"$f":"+Table!E427","v":4},{"$f":"+Table!E449","v":0},{"$f":"+Table!E471","v":0},{"$f":"+Table!E493","v":0},{"$f":"+Table!E515","v":0},null,"MediaG",0.50138888888888888,0.21249999999999999]
["Point",{"$f":"HLOOKUP(B1,E39:AB46,8,FALSE)","v":13},{"$f":"HLOOKUP(C1,E39:AB46,8,FALSE)","v":5},null,{"$f":"+Table!E10","v":0.50138888888888888},{"$f":"+Table!E32","v":0.54791666666666672},{"$f":"+Table!E54","v":0.33611111111111108},{"$f":"+Table!E76","v":0.21111111111111111},{"$f":"+Table!E98","v":0.29652777777777778},{"$f":"+Table!E120","v":0.21388888888888891},{"$f":"+Table!E142","v":0.21249999999999999},{"$f":"+Table!E164","v":8.6111111111111124E-2},{"$f":"+Table!E186","v":0.25625000000000003},{"$f":"+Table!E208","v":0.13055555555555556},{"$f":"+Table!E230","v":0.17083333333333331},{"$f":"+Table!E252","v":8.819444444444445E-2},{"$f":"+Table!E274","v":0.13125000000000001},{"$f":"+Table!E296","v":0.12847222222222224},{"$f":"+Table!E318","v":0.17500000000000002},{"$f":"+Table!E340","v":0.25694444444444448},{"$f":"+Table!E362","v":8.819444444444445E-2},{"$f":"+Table!E384","v":0.13125000000000001},{"$f":"+Table!E406","v":0.17430555555555557},{"$f":"+Table!E428","v":0.1763888888888889},{"$f":"+Table!E450","v":0},{"$f":"+Table!E472","v":0},{"$f":"+Table!E494","v":0},{"$f":"+Table!E516","v":0},null,"Point",13,5]
["Rendimento",{"$f":"HLOOKUP(B1,E39:AB46,8,FALSE)","v":13},{"$f":"HLOOKUP(C1,E39:AB46,8,FALSE)","v":5},null,{"$f":"+Table!E11","v":10},{"$f":"+Table!E33","v":4},{"$f":"+Table!E55","v":4},{"$f":"+Table!E77","v":1},{"$f":"+Table!E99","v":0},{"$f":"+Table!E121","v":-3},{"$f":"+Table!E143","v":-1},{"$f":"+Table!E165","v":-2},{"$f":"+Table!E187","v":-3},{"$f":"+Table!E209","v":-5},{"$f":"+Table!E231","v":-2},{"$f":"+Table!E253","v":-5},{"$f":"+Table!E275","v":-6},{"$f":"+Table!E297","v":-2},{"$f":"+Table!E319","v":-8},{"$f":"+Table!E341","v":-4},{"$f":"+Table!E363","v":-5},{"$f":"+Table!E385","v":-6},{"$f":"+Table!E407","v":-7},{"$f":"+Table!E429","v":-10},{"$f":"+Table!E451","v":0},{"$f":"+Table!E473","v":0},{"$f":"+Table!E495","v":0},{"$f":"+Table!E517","v":0},null,"Rendimento",13,5]
[null,null,null,null,{"$f":"+Table!E12","v":13},{"$f":"+Table!E34","v":10},{"$f":"+Table!E56","v":10},{"$f":"+Table!E78","v":8},{"$f":"+Table!E100","v":7},{"$f":"+Table!E122","v":6},{"$f":"+Table!E144","v":5},{"$f":"+Table!E166","v":5},{"$f":"+Table!E188","v":5},{"$f":"+Table!E210","v":5},{"$f":"+Table!E232","v":4},{"$f":"+Table!E254","v":4},{"$f":"+Table!E276","v":4},{"$f":"+Table!E298","v":3},{"$f":"+Table!E320","v":2},{"$f":"+Table!E342","v":1},{"$f":"+Table!E364","v":1},{"$f":"+Table!E386","v":1},{"$f":"+Table!E408","v":1},{"$f":"+Table!E430","v":1},{"$f":"+Table!E452","v":0},{"$f":"+Table!E474","v":0},{"$f":"+Table!E496","v":0},{"$f":"+Table!E518","v":0},null,0,0,0,null,{"$f":"+B51","v":"-"},{"$f":"+C65","v":"-"},null,{"$f":"IF(AH46=\"+\",1,0)","v":0},{"$f":"IF(AI46=\"+\",1,0)","v":0},null,{"$f":"(SUMIF(AK46:AL50,1))/10","v":0.4},{"$f":"100%-AN46","v":0.6}]
["Home Over/Under",null,null,null,null,null,null,null,null,null,null,null,null,null,null,null,null,null,null,null,null,null,null,null,null,null,null,null,null,"Home Over/Under",0,0,null,{"$f":"+B52","v":"+"},{"$f":"+C66","v":"-"},null,{"$f":"IF(AH47=\"+\",1,0)","v":1},{"$f":"IF(AI47=\"+\",1,0)","v":0}]
["Match",{"$f":"HLOOKUP(B1,E48:AB54,2,FALSE)","v":11},{"$f":"HLOOKUP(C1,E48:AB54,2,FALSE)","v":12},null,{"$f":"+Table!F5","v":"Frosinone"},{"$f":"+Table!F25","v":"Salernitana"},{"$f":"+Table!F45","v":"Napoli"},{"$f":"+Table!F65","v":"Atalanta"},{"$f":"+Table!F85","v":"Cagliari"},{"$f":"+Table!F105","v":"Udinese"},{"$f":"+Table!F125","v":"Roma"},{"$f":"+Table!F145","v":"Inter"},{"$f":"+Table!F165","v":"Lecce"},{"$f":"+Table!F185","v":"Fiorentina"},{"$f":"+Table!F205","v":"Sassuolo"},{"$f":"+Table!F225","v":"Milan"},{"$f":"+Table!F245","v":"Verona"},{"$f":"+Table!F265","v":"Genoa"},{"$f":"+Table!F285","v":"Bologna"},{"$f":"+Table!F305","v":"Empoli"},{"$f":"+Table!F325","v":"Torino"},{"$f":"+Table!F345","v":"Monza"},{"$f":"+Table!F365","v":"Juventus"},{"$f":"+Table!F385","v":"Lazio"},{"$f":"+Table!F405","v":0},{"$f":"+Table!F425","v":0},{"$f":"+Table!F445","v":0},{"$f":"+Table!F465","v":0},null,"Match",11,12,null,"-","+",null,0,1]
["Over",{"$f":"HLOOKUP(B1,E48:AB54,3,FALSE)","v":6},{"$f":"HLOOKUP(C1,E48:AB54,3,FALSE)","v":7},null,{"$f":"+Table!F6","v":12},{"$f":"+Table!F26","v":12},{"$f":"+Table!F46","v":11},{"$f":"+Table!F66","v":12},{"$f":"+Table!F86","v":11},{"$f":"+Table!F106","v":12},{"$f":"+Table!F126","v":11},{"$f":"+Table!F146","v":11},{"$f":"+Table!F166","v":12},{"$f":"+Table!F186","v":11},{"$f":"+Table!F206","v":10},{"$f":"+Table!F226","v":11},{"$f":"+Table!F246","v":11},{"$f":"+Table!F266","v":11},{"$f":"+Table!F286","v":11},{"$f":"+Table!F306","v":12},{"$f":"+Table!F326","v":11},{"$f":"+Table!F346","v":11},{"$f":"+Table!F366","v":11},{"$f":"+Table!F386","v":11},{"$f":"+Table!F406","v":0},{"$f":"+Table!F426","v":0},{"$f":"+Table!F446","v":0},{"$f":"+Table!F466","v":0},null,"Over",6,7,null,"+","-",null,1,0]
["Under",{"$f":"HLOOKUP(B1,E48:AB54,4,FALSE)","v":5},{"$f":"HLOOKUP(C1,E48:AB54,4,FALSE)","v":5},null,{"$f":"+Table!F7","v":10},{"$f":"+Table!F27","v":9},{"$f":"+Table!F47","v":8},{"$f":"+Table!F67","v":7},{"$f":"+Table!F87","v":7},{"$f":"+Table!F107","v":7},{"$f":"+Table!F127","v":6},{"$f":"+Table!F147","v":6},{"$f":"+Table!F167","v":6},{"$f":"+Table!F187","v":6},{"$f":"+Table!F207","v":5},{"$f":"+Table!F227","v":5},{"$f":"+Table!F247","v":5},{"$f":"+Table!F267","v":4},{"$f":"+Table!F287","v":4},{"$f":"+Table!F307","v":4},{"$f":"+Table!F327","v":4},{"$f":"+Table!F347","v":3},{"$f":"+Table!F367","v":3},{"$f":"+Table!F387","v":2},{"$f":"+Table!F407","v":0},{"$f":"+Table!F427","v":0},{"$f":"+Table!F447","v":0},{"$f":"+Table!F467","v":0},null,"Under",5,5,null,"-","+",null,0,1]
["Rendimento",{"$f":"HLOOKUP(B1,E48:AB59,8,FALSE)","v":"-"},{"$f":"HLOOKUP(C1,E48:AB59,8,FALSE)","v":"+"},null,{"$f":"+Table!F8","v":2},{"$f":"+Table!F28","v":3},{"$f":"+Table!F48","v":3},{"$f":"+Table!F68","v":5},{"$f":"+Table!F88","v":4},{"$f":"+Table!F108","v":5},{"$f":"+Table!F128","v":5},{"$f":"+Table!F148","v":5},{"$f":"+Table!F168","v":6},{"$f":"+Table!F188","v":5},{"$f":"+Table!F208","v":5},{"$f":"+Table!F228","v":6},{"$f":"+Table!F248","v":6},{"$f":"+Table!F268","v":7},{"$f":"+Table!F288","v":7},{"$f":"+Table!F308","v":8},{"$f":"+Table!F328","v":7},{"$f":"+Table!F348","v":8},{"$f":"+Table!F368","v":8},{"$f":"+Table!F388","v":9},{"$f":"+Table!F408","v":0},{"$f":"+Table!F428","v":0},{"$f":"+Table!F448","v":0},{"$f":"+Table!F468","v":0},null,"Rendimento","-","+"]
[null,{"$f":"HLOOKUP(B1,E48:AB59,9,FALSE)","v":"+"},{"$f":"HLOOKUP(C1,E48:AB59,9,FALSE)","v":"-"},null,{"$f":"+Table!F9","v":0.92986111111111114},{"$f":"+Table!F29","v":0.51666666666666672},{"$f":"+Table!F49","v":0.67708333333333337},{"$f":"+Table!F69","v":1.1305555555555555},{"$f":"+Table!F89","v":0.59583333333333333},{"$f":"+Table!F109","v":0.6381944444444444},{"$f":"+Table!F129","v":1.0062499999999999},{"$f":"+Table!F149","v":1.0875000000000001},{"$f":"+Table!F169","v":0.63680555555555551},{"$f":"+Table!F189","v":0.71597222222222223},{"$f":"+Table!F209","v":0.55208333333333337},{"$f":"+Table!F229","v":0.83819444444444446},{"$f":"+Table!F249","v":0.50972222222222219},{"$f":"+Table!F269","v":0.59166666666666667},{"$f":"+Table!F289","v":0.75486111111111109},{"$f":"+Table!F309","v":0.34513888888888888},{"$f":"+Table!F329","v":0.50416666666666665},{"$f":"+Table!F349","v":0.50763888888888886},{"$f":"+Table!F369","v":0.71180555555555547},{"$f":"+Table!F389","v":0.50486111111111109},{"$f":"+Table!F409","v":0},{"$f":"+Table!F429","v":0},{"$f":"+Table!F449","v":0},{"$f":"+Table!F469","v":0},null,{"$f":"+A60","v":0},{"$f":"+B60","v":0},{"$f":"+C60","v":0},null,{"$f":"IF(AH46=\"+\",\"OVER\",\"UNDER\")","v":"UNDER"},{"$f":"IF(AI46=\"+\",\"OVER\",\"UNDER\")","v":"UNDER"}]
[null,{"$f":"HLOOKUP(B1,E48:AB59,10,FALSE)","v":"-"},{"$f":"HLOOKUP(C1,E48:AB59,10,FALSE)","v":"+"},null,{"$f":"+Table!F10","v":"3.4"},{"$f":"+Table!F30","v":3},{"$f":"+Table!F50","v":"2.8"},{"$f":"+Table!F70","v":"2.9"},{"$f":"+Table!F90","v":"2.9"},{"$f":"+Table!F110","v":"2.8"},{"$f":"+Table!F130","v":3},{"$f":"+Table!F150","v":"2.9"},{"$f":"+Table!F170","v":"2.7"},{"$f":"+Table!F190","v":"2.5"},{"$f":"+Table!F210","v":"2.8"},{"$f":"+Table!F230","v":"2.5"},{"$f":"+Table!F250","v":"2.4"},{"$f":"+Table!F270","v":"2.4"},{"$f":"+Table!F290","v":"2.3"},{"$f":"+Table!F310","v":"2.1"},{"$f":"+Table!F330","v":"1.6"},{"$f":"+Table!F350","v":"2.1"},{"$f":"+Table!F370","v":2},{"$f":"+Table!F390","v":"1.7"},{"$f":"+Table!F410","v":0},{"$f":"+Table!F430","v":0},{"$f":"+Table!F450","v":0},{"$f":"+Table!F470","v":0},null,{"$f":"+#REF!","v":{"$error":"#REF!"}},{"$f":"+#REF!","v":{"$error":"#REF!"}},{"$f":"+#REF!","v":{"$error":"#REF!"}},null,{"$f":"IF(AH47=\"+\",\"OVER\",\"UNDER\")","v":"OVER"},"UNDER"]
[null,{"$f":"HLOOKUP(B1,E48:AB59,11,FALSE)","v":"+"},{"$f":"HLOOKUP(C1,E48:AB59,11,FALSE)","v":"-"},null,{"$f":"+Table!F12","v":"?"},{"$f":"+Table!F32","v":"?"},{"$f":"+Table!F52","v":"?"},{"$f":"+Table!F72","v":"?"},{"$f":"+Table!F92","v":"?"},{"$f":"+Table!F112","v":"?"},{"$f":"+Table!F132","v":"?"},{"$f":"+Table!F152","v":"?"},{"$f":"+Table!F172","v":"?"},{"$f":"+Table!F192","v":"?"},{"$f":"+Table!F212","v":"?"},{"$f":"+Table!F232","v":"?"},{"$f":"+Table!F252","v":"?"},{"$f":"+Table!F272","v":"?"},{"$f":"+Table!F292","v":"?"},{"$f":"+Table!F312","v":"?"},{"$f":"+Table!F332","v":"?"},{"$f":"+Table!F352","v":"?"},{"$f":"+Table!F372","v":"?"},{"$f":"+Table!F392","v":"?"},{"$f":"+Table!F412","v":0},{"$f":"+Table!F432","v":0},{"$f":"+Table!F452","v":0},{"$f":"+Table!F472","v":0},null,{"$f":"+#REF!","v":{"$error":"#REF!"}},{"$f":"+#REF!","v":{"$error":"#REF!"}},{"$f":"+#REF!","v":{"$error":"#REF!"}},null,{"$f":"IF(AH48=\"+\",\"OVER\",\"UNDER\")","v":"UNDER"},"OVER"]
[null,{"$f":"HLOOKUP(B1,E48:AB59,12,FALSE)","v":"-"},{"$f":"HLOOKUP(C1,E48:AB59,12,FALSE)","v":"+"},null,{"$f":"+Table!F14","v":"+"},{"$f":"+Table!F34","v":"+"},{"$f":"+Table!F54","v":"+"},{"$f":"+Table!F74","v":"+"},{"$f":"+Table!F94","v":"+"},{"$f":"+Table!F114","v":"-"},{"$f":"+Table!F134","v":"+"},{"$f":"+Table!F154","v":"-"},{"$f":"+Table!F174","v":"+"},{"$f":"+Table!F194","v":"-"},{"$f":"+Table!F214","v":"-"},{"$f":"+Table!F234","v":"+"},{"$f":"+Table!F254","v":"-"},{"$f":"+Table!F274","v":"+"},{"$f":"+Table!F294","v":"+"},{"$f":"+Table!F314","v":"-"},{"$f":"+Table!F334","v":"-"},{"$f":"+Table!F354","v":"-"},{"$f":"+Table!F374","v":"-"},{"$f":"+Table!F394","v":"-"},{"$f":"+Table!F414","v":0},{"$f":"+Table!F434","v":0},{"$f":"+Table!F454","v":0},{"$f":"+Table!F474","v":0},null,{"$f":"+A61","v":"Away Over/Under"},0,0,null,{"$f":"IF(AH49=\"+\",\"OVER\",\"UNDER\")","v":"OVER"},"UNDER"]
[null,null,null,null,{"$f":"+Table!F16","v":"+"},{"$f":"+Table!F36","v":"+"},{"$f":"+Table!F56","v":"+"},{"$f":"+Table!F76","v":"-"},{"$f":"+Table!F96","v":"+"},{"$f":"+Table!F116","v":"+"},{"$f":"+Table!F136","v":"-"},{"$f":"+Table!F156","v":"+"},{"$f":"+Table!F176","v":"+"},{"$f":"+Table!F196","v":"+"},{"$f":"+Table!F216","v":"+"},{"$f":"+Table!F236","v":"+"},{"$f":"+Table!F256","v":"+"},{"$f":"+Table!F276","v":"-"},{"$f":"+Table!F296","v":"-"},{"$f":"+Table!F316","v":"+"},{"$f":"+Table!F336","v":"+"},{"$f":"+Table!F356","v":"+"},{"$f":"+Table!F376","v":"+"},{"$f":"+Table!F396","v":"-"},{"$f":"+Table!F416","v":0},{"$f":"+Table!F436","v":0},{"$f":"+Table!F456","v":0},{"$f":"+Table!F476","v":0},null,"Match",11,10,null,{"$f":"IF(AH50=\"+\",\"OVER\",\"UNDER\")","v":"UNDER"},"OVER"]
[null,null,null,null,{"$f":"+Table!F18","v":"+"},{"$f":"+Table!F38","v":"+"},{"$f":"+Table!F58","v":"-"},{"$f":"+Table!F78","v":"+"},{"$f":"+Table!F98","v":"-"},{"$f":"+Table!F118","v":"+"},{"$f":"+Table!F138","v":"-"},{"$f":"+Table!F158","v":"-"},{"$f":"+Table!F178","v":"-"},{"$f":"+Table!F198","v":"-"},{"$f":"+Table!F218","v":"+"},{"$f":"+Table!F238","v":"-"},{"$f":"+Table!F258","v":"-"},{"$f":"+Table!F278","v":"-"},{"$f":"+Table!F296","v":"-"},{"$f":"+Table!F318","v":"+"},{"$f":"+Table!F338","v":"-"},{"$f":"+Table!F358","v":"-"},{"$f":"+Table!F378","v":"-"},{"$f":"+Table!F398","v":"+"},{"$f":"+Table!F418","v":0},{"$f":"+Table!F438","v":0},{"$f":"+Table!F458","v":0},{"$f":"+Table!F478","v":0},null,"Over",5,5]
[null,null,null,null,{"$f":"+Table!F20","v":"+"},{"$f":"+Table!F40","v":"+"},{"$f":"+Table!F60","v":"+"},{"$f":"+Table!F80","v":"-"},{"$f":"+Table!F100","v":"+"},{"$f":"+Table!F120","v":"+"},{"$f":"+Table!F140","v":"-"},{"$f":"+Table!F160","v":"+"},{"$f":"+Table!F180","v":"+"},{"$f":"+Table!F200","v":"-"},{"$f":"+Table!F220","v":"+"},{"$f":"+Table!F240","v":"+"},{"$f":"+Table!F260","v":"-"},{"$f":"+Table!F280","v":"-"},{"$f":"+Table!F298","v":"-"},{"$f":"+Table!F320","v":"-"},{"$f":"+Table!F340","v":"-"},{"$f":"+Table!F360","v":"-"},{"$f":"+Table!F380","v":"-"},{"$f":"+Table!F400","v":"-"},{"$f":"+Table!F420","v":0},{"$f":"+Table!F440","v":0},{"$f":"+Table!F460","v":0},{"$f":"+Table!F480","v":0},null,"Under",6,5]
[null,null,null,null,{"$f":"+Table!F22","v":"-"},{"$f":"+Table!F42","v":"+"},{"$f":"+Table!F62","v":"+"},{"$f":"+Table!F82","v":"+"},{"$f":"+Table!F102","v":"-"},{"$f":"+Table!F122","v":"+"},{"$f":"+Table!F142","v":"+"},{"$f":"+Table!F162","v":"-"},{"$f":"+Table!F182","v":"-"},{"$f":"+Table!F202","v":"+"},{"$f":"+Table!F222","v":"-"},{"$f":"+Table!F242","v":"+"},{"$f":"+Table!F262","v":"-"},{"$f":"+Table!F282","v":"-"},{"$f":"+Table!F300","v":"-"},{"$f":"+Table!F322","v":"-"},{"$f":"+Table!F342","v":"+"},{"$f":"+Table!F362","v":"+"},{"$f":"+Table!F382","v":"-"},{"$f":"+Table!F402","v":"-"},{"$f":"+Table!F422","v":0},{"$f":"+Table!F442","v":0},{"$f":"+Table!F462","v":0},{"$f":"+Table!F482","v":0},null,"Rendimento","-","-"]
[null,null,null,null,5,{"$f":"20+E60","v":25},{"$f":"20+F60","v":45},65,85,105,125,145,165,185,205,225,245,265,285,305,325,345,365,385,405,425,445,465,null,0,"+","-"]
["Away Over/Under",null,null,null,12,{"$f":"20+E61","v":32},{"$f":"20+F61","v":52},72,92,112,132,152,172,192,212,232,252,272,292,312,332,352,372,392,412,432,452,472,null,0,"-","+"]
["Match",{"$f":"HLOOKUP(B1,E62:AB73,2,FALSE)","v":11},{"$f":"HLOOKUP(C1,E62:AB73,2,FALSE)","v":10},null,{"$f":"+Table!G5","v":"Milan"},{"$f":"+Table!G25","v":"Sassuolo"},{"$f":"+Table!G45","v":"Frosinone"},{"$f":"+Table!G65","v":"Roma"},{"$f":"+Table!G85","v":"Lazio"},{"$f":"+Table!G105","v":"Napoli"},{"$f":"+Table!G125","v":"Salernitana"},{"$f":"+Table!G145","v":"Cagliari"},{"$f":"+Table!G165","v":"Bologna"},{"$f":"+Table!G185","v":"Juventus"},{"$f":"+Table!G205","v":"Verona"},{"$f":"+Table!G225","v":"Atalanta"},{"$f":"+Table!G245","v":"Inter"},{"$f":"+Table!G265","v":"Monza"},{"$f":"+Table!G285","v":"Genoa"},{"$f":"+Table!G305","v":"Fiorentina"},{"$f":"+Table!G325","v":"Udinese"},{"$f":"+Table!G345","v":"Empoli"},{"$f":"+Table!G365","v":"Lecce"},{"$f":"+Table!G385","v":"Torino"},{"$f":"+Table!G405","v":0},{"$f":"+Table!G425","v":0},{"$f":"+Table!G445","v":0},{"$f":"+Table!G465","v":0},null,0,"-","-"]
["Over",{"$f":"HLOOKUP(B1,E62:AB73,3,FALSE)","v":5},{"$f":"HLOOKUP(C1,E62:AB73,3,FALSE)","v":5},null,{"$f":"+Table!G6","v":12},{"$f":"+Table!G26","v":12},{"$f":"+Table!G46","v":11},{"$f":"+Table!G66","v":11},{"$f":"+Table!G86","v":11},{"$f":"+Table!G106","v":11},{"$f":"+Table!G126","v":11},{"$f":"+Table!G146","v":11},{"$f":"+Table!G166","v":11},{"$f":"+Table!G186","v":12},{"$f":"+Table!G206","v":12},{"$f":"+Table!G226","v":10},{"$f":"+Table!G246","v":11},{"$f":"+Table!G266","v":12},{"$f":"+Table!G286","v":12},{"$f":"+Table!G306","v":11},{"$f":"+Table!G326","v":11},{"$f":"+Table!G346","v":11},{"$f":"+Table!G366","v":11},{"$f":"+Table!G386","v":11},{"$f":"+Table!G406","v":0},{"$f":"+Table!G426","v":0},{"$f":"+Table!G446","v":0},{"$f":"+Table!G466","v":0}]
["Under",{"$f":"HLOOKUP(B1,E62:AB73,4,FALSE)","v":6},{"$f":"HLOOKUP(C1,E62:AB73,4,FALSE)","v":5},null,{"$f":"+Table!G7","v":10},{"$f":"+Table!G27","v":8},{"$f":"+Table!G47","v":6},{"$f":"+Table!G67","v":6},{"$f":"+Table!G87","v":6},{"$f":"+Table!G107","v":6},{"$f":"+Table!G127","v":6},{"$f":"+Table!G147","v":6},{"$f":"+Table!G167","v":6},{"$f":"+Table!G187","v":6},{"$f":"+Table!G207","v":6},{"$f":"+Table!G227","v":5},{"$f":"+Table!G247","v":5},{"$f":"+Table!G267","v":5},{"$f":"+Table!G287","v":5},{"$f":"+Table!G307","v":4},{"$f":"+Table!G327","v":4},{"$f":"+Table!G347","v":4},{"$f":"+Table!G367","v":4},{"$f":"+Table!G387","v":3},{"$f":"+Table!G407","v":0},{"$f":"+Table!G427","v":0},{"$f":"+Table!G447","v":0},{"$f":"+Table!G467","v":0}]
["Rendimento",{"$f":"HLOOKUP(B1,E62:AB73,8,FALSE)","v":"-"},{"$f":"HLOOKUP(C1,E62:AB73,8,FALSE)","v":"-"},null,{"$f":"+Table!G8","v":2},{"$f":"+Table!G28","v":4},{"$f":"+Table!G48","v":5},{"$f":"+Table!G68","v":5},{"$f":"+Table!G88","v":5},{"$f":"+Table!G108","v":5},{"$f":"+Table!G128","v":5},{"$f":"+Table!G148","v":5},{"$f":"+Table!G168","v":5},{"$f":"+Table!G188","v":6},{"$f":"+Table!G208","v":6},{"$f":"+Table!G228","v":5},{"$f":"+Table!G248","v":6},{"$f":"+Table!G268","v":7},{"$f":"+Table!G288","v":7},{"$f":"+Table!G308","v":7},{"$f":"+Table!G328","v":7},{"$f":"+Table!G348","v":7},{"$f":"+Table!G368","v":7},{"$f":"+Table!G388","v":8},{"$f":"+Table!G408","v":0},{"$f":"+Table!G428","v":0},{"$f":"+Table!G448","v":0},{"$f":"+Table!G468","v":0}]
[null,{"$f":"HLOOKUP(B1,E62:AB73,9,FALSE)","v":"+"},{"$f":"HLOOKUP(C1,E62:AB73,9,FALSE)","v":"-"},null,{"$f":"+Table!G9","v":1.0972222222222221},{"$f":"+Table!G29","v":0.6430555555555556},{"$f":"+Table!G49","v":0.3923611111111111},{"$f":"+Table!G69","v":"12:17:00"},{"$f":"+Table!G89","v":0.55277777777777781},{"$f":"+Table!G109","v":0.6743055555555556},{"$f":"+Table!G129","v":0.30555555555555552},{"$f":"+Table!G149","v":0.30555555555555552},{"$f":"+Table!G169","v":0.46875},{"$f":"+Table!G189","v":0.79791666666666661},{"$f":"+Table!G209","v":"09:18:00"},{"$f":"+Table!G229","v":0.55138888888888882},{"$f":"+Table!G249","v":1.0444444444444445},{"$f":"+Table!G269","v":0.38680555555555557},{"$f":"+Table!G289","v":0.42638888888888887},{"$f":"+Table!G309","v":0.59305555555555556},{"$f":"+Table!G329","v":0.34583333333333338},{"$f":"+Table!G349","v":0.30486111111111108},{"$f":"+Table!G369","v":0.38611111111111113},{"$f":"+Table!G389","v":0.34236111111111112},{"$f":"+Table!G409","v":0},{"$f":"+Table!G429","v":0},{"$f":"+Table!G449","v":0},{"$f":"+Table!G469","v":0}]
[null,{"$f":"HLOOKUP(B1,E62:AB73,10,FALSE)","v":"-"},{"$f":"HLOOKUP(C1,E62:AB73,10,FALSE)","v":"+"},null,{"$f":"+Table!G10","v":"3.8"},{"$f":"+Table!G30","v":"3.4"},{"$f":"+Table!G50","v":"3.1"},{"$f":"+Table!G70","v":"2.6"},{"$f":"+Table!G90","v":"2.6"},{"$f":"+Table!G110","v":"2.5"},{"$f":"+Table!G130","v":"2.5"},{"$f":"+Table!G150","v":"2.5"},{"$f":"+Table!G170","v":"2.4"},{"$f":"+Table!G190","v":"2.3"},{"$f":"+Table!G210","v":"2.3"},{"$f":"+Table!G230","v":"2.7"},{"$f":"+Table!G250","v":"2.6"},{"$f":"+Table!G270","v":"2.2"},{"$f":"+Table!G290","v":2},{"$f":"+Table!G310","v":"2.5"},{"$f":"+Table!G330","v":"2.4"},{"$f":"+Table!G350","v":"2.4"},{"$f":"+Table!G370","v":"2.3"},{"$f":"+Table!G390","v":"1.9"},{"$f":"+Table!G410","v":0},{"$f":"+Table!G430","v":0},{"$f":"+Table!G450","v":0},{"$f":"+Table!G470","v":0}]
[null,{"$f":"HLOOKUP(B1,E62:AB73,11,FALSE)","v":"-"},{"$f":"HLOOKUP(C1,E62:AB73,11,FALSE)","v":"-"},null,{"$f":"+Table!G12","v":"?"},{"$f":"+Table!G32","v":"?"},{"$f":"+Table!G52","v":"?"},{"$f":"+Table!G72","v":"?"},{"$f":"+Table!G92","v":"?"},{"$f":"+Table!G112","v":"?"},{"$f":"+Table!G132","v":"?"},{"$f":"+Table!G152","v":"?"},{"$f":"+Table!G172","v":"?"},{"$f":"+Table!G192","v":"?"},{"$f":"+Table!G212","v":"?"},{"$f":"+Table!G232","v":"?"},{"$f":"+Table!G252","v":"?"},{"$f":"+Table!G272","v":"?"},{"$f":"+Table!G292","v":"?"},{"$f":"+Table!G312","v":"?"},{"$f":"+Table!G332","v":"?"},{"$f":"+Table!G352","v":"?"},{"$f":"+Table!G372","v":"?"},{"$f":"+Table!G392","v":"?"},{"$f":"+Table!G412","v":0},{"$f":"+Table!G432","v":0},{"$f":"+Table!G452","v":0},{"$f":"+Table!G472","v":0}]
[null,{"$f":"HLOOKUP(B1,E62:AB73,12,FALSE)","v":"+"},{"$f":"HLOOKUP(C1,E62:AB73,12,FALSE)","v":"+"},null,{"$f":"+Table!G14","v":"+"},{"$f":"+Table!G34","v":"+"},{"$f":"+Table!G54","v":"-"},{"$f":"+Table!G74","v":"+"},{"$f":"+Table!G94","v":"+"},{"$f":"+Table!G114","v":"-"},{"$f":"+Table!G134","v":"-"},{"$f":"+Table!G154","v":"+"},{"$f":"+Table!G174","v":"+"},{"$f":"+Table!G194","v":"-"},{"$f":"+Table!G214","v":"+"},{"$f":"+Table!G234","v":"-"},{"$f":"+Table!G254","v":"-"},{"$f":"+Table!G274","v":"-"},{"$f":"+Table!G294","v":"-"},{"$f":"+Table!G314","v":"+"},{"$f":"+Table!G334","v":"-"},{"$f":"+Table!G354","v":"-"},{"$f":"+Table!G374","v":"+"},{"$f":"+Table!G394","v":"+"},{"$f":"+Table!G414","v":0},{"$f":"+Table!G434","v":0},{"$f":"+Table!G454","v":0},{"$f":"+Table!G474","v":0}]
[null,null,null,null,{"$f":"+Table!G16","v":"+"},{"$f":"+Table!G36","v":"-"},{"$f":"+Table!G56","v":"+"},{"$f":"+Table!G76","v":"+"},{"$f":"+Table!G96","v":"+"},{"$f":"+Table!G116","v":"+"},{"$f":"+Table!G136","v":"+"},{"$f":"+Table!G156","v":"-"},{"$f":"+Table!G176","v":"+"},{"$f":"+Table!G196","v":"+"},{"$f":"+Table!G216","v":"+"},{"$f":"+Table!G236","v":"-"},{"$f":"+Table!G256","v":"+"},{"$f":"+Table!G276","v":"+"},{"$f":"+Table!G296","v":"+"},{"$f":"+Table!G316","v":"-"},{"$f":"+Table!G336","v":"+"},{"$f":"+Table!G356","v":"+"},{"$f":"+Table!G376","v":"-"},{"$f":"+Table!G396","v":"-"},{"$f":"+Table!G416","v":0},{"$f":"+Table!G436","v":0},{"$f":"+Table!G456","v":0},{"$f":"+Table!G476","v":0}]
[null,null,null,null,{"$f":"+Table!G18","v":"+"},{"$f":"+Table!G38","v":"+"},{"$f":"+Table!G58","v":"+"},{"$f":"+Table!G78","v":"-"},{"$f":"+Table!G98","v":"-"},{"$f":"+Table!G118","v":"-"},{"$f":"+Table!G138","v":"-"},{"$f":"+Table!G158","v":"-"},{"$f":"+Table!G178","v":"+"},{"$f":"+Table!G198","v":"+"},{"$f":"+Table!G218","v":"+"},{"$f":"+Table!G238","v":"+"},{"$f":"+Table!G258","v":"-"},{"$f":"+Table!G278","v":"+"},{"$f":"+Table!G298","v":"-"},{"$f":"+Table!G318","v":"-"},{"$f":"+Table!G338","v":"-"},{"$f":"+Table!G358","v":"-"},{"$f":"+Table!G378","v":"-"},{"$f":"+Table!G398","v":"-"},{"$f":"+Table!G418","v":0},{"$f":"+Table!G438","v":0},{"$f":"+Table!G458","v":0},{"$f":"+Table!G478","v":0}]
[null,null,null,null,{"$f":"+Table!G20","v":"+"},{"$f":"+Table!G40","v":"-"},{"$f":"+Table!G60","v":"+"},{"$f":"+Table!G80","v":"-"},{"$f":"+Table!G100","v":"-"},{"$f":"+Table!G120","v":"-"},{"$f":"+Table!G140","v":"+"},{"$f":"+Table!G160","v":"+"},{"$f":"+Table!G180","v":"+"},{"$f":"+Table!G200","v":"+"},{"$f":"+Table!G220","v":"-"},{"$f":"+Table!G240","v":"-"},{"$f":"+Table!G260","v":"-"},{"$f":"+Table!G280","v":"-"},{"$f":"+Table!G300","v":"+"},{"$f":"+Table!G320","v":"-"},{"$f":"+Table!G340","v":"+"},{"$f":"+Table!G360","v":"-"},{"$f":"+Table!G380","v":"-"},{"$f":"+Table!G400","v":"-"},{"$f":"+Table!G420","v":0},{"$f":"+Table!G440","v":0},{"$f":"+Table!G460","v":0},{"$f":"+Table!G480","v":0}]
[null,null,null,null,{"$f":"+Table!G22","v":"+"},{"$f":"+Table!G42","v":"+"},{"$f":"+Table!G62","v":"+"},{"$f":"+Table!G82","v":"+"},{"$f":"+Table!G102","v":"+"},{"$f":"+Table!G122","v":"+"},{"$f":"+Table!G142","v":"+"},{"$f":"+Table!G162","v":"-"},{"$f":"+Table!G182","v":"-"},{"$f":"+Table!G202","v":"-"},{"$f":"+Table!G222","v":"+"},{"$f":"+Table!G242","v":"+"},{"$f":"+Table!G262","v":"+"},{"$f":"+Table!G282","v":"+"},{"$f":"+Table!G302","v":"-"},{"$f":"+Table!G322","v":"-"},{"$f":"+Table!G342","v":"+"},{"$f":"+Table!G362","v":"-"},{"$f":"+Table!G382","v":"-"},{"$f":"+Table!G402","v":"-"},{"$f":"+Table!G422","v":0},{"$f":"+Table!G442","v":0},{"$f":"+Table!G462","v":0},{"$f":"+Table!G482","v":0}]
[]
[]
["Forma x Grafico Home",null,null,null,{"$f":"+Table!B5","v":"Inter"},{"$f":"+Table!B27","v":"Atalanta"},{"$f":"+Table!B49","v":"Juventus"},{"$f":"+Table!B71","v":"Bologna"},{"$f":"+Table!B93","v":"Milan"},{"$f":"+Table!B115","v":"Roma"},{"$f":"+Table!B137","v":"Lazio"},{"$f":"+Table!B159","v":"Fiorentina"},{"$f":"+Table!B181","v":"Torino"},{"$f":"+Table!B203","v":"Frosinone"},{"$f":"+Table!B225","v":"Lecce"},{"$f":"+Table!B247","v":"Genoa"},{"$f":"+Table!B269","v":"Napoli"},{"$f":"+Table!B291","v":"Monza"},{"$f":"+Table!B313","v":"Cagliari"},{"$f":"+Table!B335","v":"Verona"},{"$f":"+Table!B357","v":"Sassuolo"},{"$f":"+Table!B379","v":"Udinese"},{"$f":"+Table!B401","v":"Empoli"},{"$f":"+Table!B423","v":"Salernitana"},{"$f":"+Table!B445","v":0},{"$f":"+Table!B467","v":0},{"$f":"+Table!B489","v":0},{"$f":"+Table!B511","v":0}]
[1,{"$f":"HLOOKUP(B1,E76:AB81,2,FALSE)","v":"V"},{"$f":"HLOOKUP(C1,E76:AC81,2,FALSE)","v":"V"},null,{"$f":"+Table!B16","v":"V"},{"$f":"+Table!B38","v":"V"},{"$f":"+Table!B60","v":"N"},{"$f":"+Table!B82","v":"V"},{"$f":"+Table!B104","v":"N"},{"$f":"+Table!B126","v":"V"},{"$f":"+Table!B148","v":"N"},{"$f":"+Table!B170","v":"P"},{"$f":"+Table!B192","v":"N"},{"$f":"+Table!B214","v":"P"},{"$f":"+Table!B236","v":"V"},{"$f":"+Table!B258","v":"V"},{"$f":"+Table!B280","v":"V"},{"$f":"+Table!B302","v":"V"},{"$f":"+Table!B324","v":"P"},{"$f":"+Table!B346","v":"N"},{"$f":"+Table!B368","v":"V"},{"$f":"+Table!B390","v":"N"},{"$f":"+Table!B412","v":"N"},{"$f":"+Table!B434","v":"P"},{"$f":"+Table!B456","v":0},{"$f":"+Table!B478","v":0},{"$f":"+Table!B500","v":0},{"$f":"+Table!B522","v":0}]
[2,{"$f":"HLOOKUP(B1,E76:AB81,3,FALSE)","v":"V"},{"$f":"HLOOKUP(C1,E76:AC81,3,FALSE)","v":"V"},null,{"$f":"+Table!B18","v":"V"},{"$f":"+Table!B40","v":"V"},{"$f":"+Table!B62","v":"V"},{"$f":"+Table!B84","v":"N"},{"$f":"+Table!B106","v":"V"},{"$f":"+Table!B128","v":"N"},{"$f":"+Table!B150","v":"V"},{"$f":"+Table!B172","v":"N"},{"$f":"+Table!B194","v":"V"},{"$f":"+Table!B216","v":"V"},{"$f":"+Table!B238","v":"P"},{"$f":"+Table!B260","v":"N"},{"$f":"+Table!B282","v":"V"},{"$f":"+Table!B304","v":"P"},{"$f":"+Table!B326","v":"V"},{"$f":"+Table!B348","v":"V"},{"$f":"+Table!B370","v":"P"},{"$f":"+Table!B392","v":"P"},{"$f":"+Table!B414","v":"V"},{"$f":"+Table!B436","v":"P"},{"$f":"+Table!B458","v":0},{"$f":"+Table!B480","v":0},{"$f":"+Table!B502","v":0},{"$f":"+Table!B524","v":0}]
[3,{"$f":"HLOOKUP(B1,E76:AB81,4,FALSE)","v":"V"},{"$f":"HLOOKUP(C1,E76:AC81,4,FALSE)","v":"V"},null,{"$f":"+Table!B20","v":"V"},{"$f":"+Table!B42","v":"V"},{"$f":"+Table!B64","v":"V"},{"$f":"+Table!B86","v":"V"},{"$f":"+Table!B108","v":"V"},{"$f":"+Table!B130","v":"V"},{"$f":"+Table!B152","v":"V"},{"$f":"+Table!B174","v":"V"},{"$f":"+Table!B196","v":"N"},{"$f":"+Table!B218","v":"P"},{"$f":"+Table!B240","v":"N"},{"$f":"+Table!B262","v":"N"},{"$f":"+Table!B284","v":"N"},{"$f":"+Table!B306","v":"P"},{"$f":"+Table!B328","v":"N"},{"$f":"+Table!B350","v":"P"},{"$f":"+Table!B372","v":"P"},{"$f":"+Table!B394","v":"P"},{"$f":"+Table!B416","v":"P"},{"$f":"+Table!B438","v":"P"},{"$f":"+Table!B460","v":0},{"$f":"+Table!B482","v":0},{"$f":"+Table!B504","v":0},{"$f":"+Table!B526","v":0}]
[4,{"$f":"HLOOKUP(B1,E76:AB81,5,FALSE)","v":"V"},{"$f":"HLOOKUP(C1,E76:AC81,5,FALSE)","v":"V"},null,{"$f":"+Table!B22","v":"V"},{"$f":"+Table!B44","v":"V"},{"$f":"+Table!B66","v":"V"},{"$f":"+Table!B88","v":"V"},{"$f":"+Table!B110","v":"V"},{"$f":"+Table!B132","v":"N"},{"$f":"+Table!B154","v":"P"},{"$f":"+Table!B176","v":"V"},{"$f":"+Table!B198","v":"V"},{"$f":"+Table!B220","v":"P"},{"$f":"+Table!B242","v":"V"},{"$f":"+Table!B264","v":"N"},{"$f":"+Table!B286","v":"V"},{"$f":"+Table!B308","v":"V"},{"$f":"+Table!B330","v":"V"},{"$f":"+Table!B352","v":"V"},{"$f":"+Table!B374","v":"N"},{"$f":"+Table!B396","v":"V"},{"$f":"+Table!B418","v":"P"},{"$f":"+Table!B440","v":"N"},{"$f":"+Table!B462","v":0},{"$f":"+Table!B484","v":0},{"$f":"+Table!B506","v":0},{"$f":"+Table!B528","v":0}]
[5,{"$f":"HLOOKUP(B1,E76:AB81,6,FALSE)","v":"V"},{"$f":"HLOOKUP(C1,E76:AC81,6,FALSE)","v":"V"},null,{"$f":"+Table!B24","v":"V"},{"$f":"+Table!B46","v":"V"},{"$f":"+Table!B68","v":"N"},{"$f":"+Table!B90","v":"V"},{"$f":"+Table!B112","v":"V"},{"$f":"+Table!B134","v":"V"},{"$f":"+Table!B156","v":"V"},{"$f":"+Table!B178","v":"V"},{"$f":"+Table!B200","v":"V"},{"$f":"+Table!B222","v":"N"},{"$f":"+Table!B244","v":"N"},{"$f":"+Table!B266","v":"N"},{"$f":"+Table!B288","v":"P"},{"$f":"+Table!B310","v":"P"},{"$f":"+Table!B332","v":"N"},{"$f":"+Table!B354","v":"N"},{"$f":"+Table!B376","v":"N"},{"$f":"+Table!B398","v":"N"},{"$f":"+Table!B420","v":"N"},{"$f":"+Table!B442","v":"P"},{"$f":"+Table!B464","v":0},{"$f":"+Table!B486","v":0},{"$f":"+Table!B508","v":0},{"$f":"+Table!B530","v":0}]
[]
[]
[]
["Forma x Grafico Away",null,null,null,{"$f":"+Table!C4","v":"Inter"},{"$f":"+Table!C27","v":"Juventus"},{"$f":"+Table!C49","v":"Milan"},{"$f":"+Table!C71","v":"Napoli"},{"$f":"+Table!C93","v":"Fiorentina"},{"$f":"+Table!C115","v":"Lazio"},{"$f":"+Table!C137","v":"Monza"},{"$f":"+Table!C159","v":"Torino"},{"$f":"+Table!C181","v":"Genoa"},{"$f":"+Table!C203","v":"Atalanta"},{"$f":"+Table!C225","v":"Roma"},{"$f":"+Table!C247","v":"Bologna"},{"$f":"+Table!C269","v":"Udinese"},{"$f":"+Table!C291","v":"Empoli"},{"$f":"+Table!C313","v":"Sassuolo"},{"$f":"+Table!C335","v":"Salernitana"},{"$f":"+Table!C357","v":"Lecce"},{"$f":"+Table!C379","v":"Verona"},{"$f":"+Table!C401","v":"Cagliari"},{"$f":"+Table!C423","v":"Frosinone"},{"$f":"+Table!C445","v":0},{"$f":"+Table!C467","v":0},{"$f":"+Table!C489","v":0},{"$f":"+Table!C511","v":0}]
[1,{"$f":"HLOOKUP(B1,E85:AB90,2,FALSE)","v":"V"},{"$f":"HLOOKUP(C1,E85:AB90,2,FALSE)","v":"N"},null,{"$f":"+Table!C16","v":"V"},{"$f":"+Table!C38","v":"P"},{"$f":"+Table!C60","v":"V"},{"$f":"+Table!C82","v":"N"},{"$f":"+Table!C104","v":"P"},{"$f":"+Table!C126","v":"P"},{"$f":"+Table!C148","v":"N"},{"$f":"+Table!C170","v":"V"},{"$f":"+Table!C192","v":"N"},{"$f":"+Table!C214","v":"N"},{"$f":"+Table!C236","v":"V"},{"$f":"+Table!C258","v":"N"},{"$f":"+Table!C280","v":"P"},{"$f":"+Table!C302","v":"N"},{"$f":"+Table!C324","v":"P"},{"$f":"+Table!C346","v":"N"},{"$f":"+Table!C368","v":"P"},{"$f":"+Table!C390","v":"P"},{"$f":"+Table!C412","v":"P"},{"$f":"+Table!C434","v":"N"},{"$f":"+Table!C456","v":0},{"$f":"+Table!C478","v":0},{"$f":"+Table!C500","v":0},{"$f":"+Table!C522","v":0}]
[2,{"$f":"HLOOKUP(B1,E85:AB90,3,FALSE)","v":"V"},{"$f":"HLOOKUP(C1,E85:AB90,3,FALSE)","v":"P"},null,{"$f":"+Table!C18","v":"V"},{"$f":"+Table!C40","v":"V"},{"$f":"+Table!C62","v":"V"},{"$f":"+Table!C84","v":"P"},{"$f":"+Table!C106","v":"P"},{"$f":"+Table!C128","v":"V"},{"$f":"+Table!C150","v":"P"},{"$f":"+Table!C172","v":"N"},{"$f":"+Table!C194","v":"V"},{"$f":"+Table!C216","v":"P"},{"$f":"+Table!C238","v":"P"},{"$f":"+Table!C260","v":"P"},{"$f":"+Table!C282","v":"N"},{"$f":"+Table!C304","v":"P"},{"$f":"+Table!C326","v":"P"},{"$f":"+Table!C348","v":"P"},{"$f":"+Table!C370","v":"P"},{"$f":"+Table!C392","v":"P"},{"$f":"+Table!C414","v":"N"},{"$f":"+Table!C436","v":"P"},{"$f":"+Table!C458","v":0},{"$f":"+Table!C480","v":0},{"$f":"+Table!C502","v":0},{"$f":"+Table!C524","v":0}]
[3,{"$f":"HLOOKUP(B1,E85:AB90,4,FALSE)","v":"N"},{"$f":"HLOOKUP(C1,E85:AB90,4,FALSE)","v":"P"},null,{"$f":"+Table!C20","v":"N"},{"$f":"+Table!C42","v":"V"},{"$f":"+Table!C64","v":"V"},{"$f":"+Table!C86","v":"P"},{"$f":"+Table!C108","v":"V"},{"$f":"+Table!C130","v":"V"},{"$f":"+Table!C152","v":"V"},{"$f":"+Table!C174","v":"P"},{"$f":"+Table!C196","v":"N"},{"$f":"+Table!C218","v":"P"},{"$f":"+Table!C240","v":"P"},{"$f":"+Table!C262","v":"P"},{"$f":"+Table!C284","v":"N"},{"$f":"+Table!C306","v":"N"},{"$f":"+Table!C328","v":"P"},{"$f":"+Table!C350","v":"V"},{"$f":"+Table!C372","v":"P"},{"$f":"+Table!C394","v":"P"},{"$f":"+Table!C416","v":"P"},{"$f":"+Table!C438","v":"P"},{"$f":"+Table!C460","v":0},{"$f":"+Table!C482","v":0},{"$f":"+Table!C504","v":0},{"$f":"+Table!C526","v":0}]
[4,{"$f":"HLOOKUP(B1,E85:AB90,5,FALSE)","v":"V"},{"$f":"HLOOKUP(C1,E85:AB90,5,FALSE)","v":"N"},null,{"$f":"+Table!C22","v":"V"},{"$f":"+Table!C44","v":"V"},{"$f":"+Table!C66","v":"N"},{"$f":"+Table!C88","v":"P"},{"$f":"+Table!C110","v":"N"},{"$f":"+Table!C132","v":"N"},{"$f":"+Table!C154","v":"N"},{"$f":"+Table!C176","v":"N"},{"$f":"+Table!C198","v":"V"},{"$f":"+Table!C220","v":"N"},{"$f":"+Table!C242","v":"P"},{"$f":"+Table!C264","v":"V"},{"$f":"+Table!C286","v":"P"},{"$f":"+Table!C308","v":"P"},{"$f":"+Table!C330","v":"P"},{"$f":"+Table!C352","v":"P"},{"$f":"+Table!C374","v":"P"},{"$f":"+Table!C396","v":"P"},{"$f":"+Table!C418","v":"P"},{"$f":"+Table!C440","v":"P"},{"$f":"+Table!C462","v":0},{"$f":"+Table!C484","v":0},{"$f":"+Table!C506","v":0},{"$f":"+Table!C528","v":0}]
[5,{"$f":"HLOOKUP(B1,E85:AB90,6,FALSE)","v":"V"},{"$f":"HLOOKUP(C1,E85:AB90,6,FALSE)","v":"V"},null,{"$f":"+Table!C24","v":"V"},{"$f":"+Table!C46","v":"N"},{"$f":"+Table!C68","v":"P"},{"$f":"+Table!C90","v":"V"},{"$f":"+Table!C112","v":"P"},{"$f":"+Table!C134","v":"P"},{"$f":"+Table!C156","v":"P"},{"$f":"+Table!C178","v":"P"},{"$f":"+Table!C200","v":"P"},{"$f":"+Table!C222","v":"V"},{"$f":"+Table!C244","v":"V"},{"$f":"+Table!C266","v":"N"},{"$f":"+Table!C288","v":"P"},{"$f":"+Table!C310","v":"N"},{"$f":"+Table!C332","v":"N"},{"$f":"+Table!C354","v":"P"},{"$f":"+Table!C376","v":"N"},{"$f":"+Table!C398","v":"N"},{"$f":"+Table!C420","v":"P"},{"$f":"+Table!C442","v":"P"},{"$f":"+Table!C464","v":0},{"$f":"+Table!C486","v":0},{"$f":"+Table!C508","v":0},{"$f":"+Table!C530","v":0}]